{"text_format":"1","workbook":"xlsx","n_sheets":19,"sheets":["Portada","Instrucciones","Datos de entrada","Municipios Proyecto Regional","Resultados","Interpretación de Resultados","Cálculo","Ponderaciones","Fichas técnicas Tecnologías","CDF y CRT-TMB","CDF y CRT-DA","Valoración","Costos de operación","Costos de inversión","Información municipios","Información referencia","Medidas Escenarios","Listas","Nacional_Área"],"not_rendered":{"charts":0,"images":9,"macros":1,"external_links":0,"defined_names":4,"comments":6,"pivot_tables":0},"unopened":[],"bounds":{"document_bytes":16777216,"sheet_cells":100000,"rows_first":2000,"rows_last":500,"rows_between":2000,"halvings":0,"cell_chars":16384,"cell_head_chars":4096},"cells_cut":0,"cells_raw":0,"read":"whole","date_system":"1900"}

{"sheet":"Portada","index":0,"n_rows":0,"n_cols":0,"rows_kept":0,"cut":false,"hidden":false,"merged":[]}

{"sheet":"Instrucciones","index":1,"n_rows":14,"n_cols":1,"rows_kept":14,"cut":false,"hidden":false,"merged":[[4,0,4,10],[0,0,0,10],[2,0,2,10],[13,0,13,10],[12,0,12,10],[6,0,6,10],[8,0,8,10],[10,0,10,10]]}
["INTRODUCCIÒN"]
[]
["El presente Modelo de Toma de Decisiones (MTD) ofrece partiendo de la informacion suministrada por el usuario realizar un analisis de alternativas para reducir la cantidad de residuos sólidos objeto del Servicio Público de Aseo (SPA) que son destinados a la disposición final en Colombia a travès de la implementaciòn de tecnologias de tratamiento de residuos solidos."]
[]
["OBJETIVOS"]
[]
["1) Brindar un insumo que permita al usuario tomar decisiones frente a la implementación de tecnologías de tratamiento de residuos sólidos y que sirva de hoja de ruta inicial donde se identifiquen las consideraciones para garantizar el éxito de su implementación. \n2) Identificar, dentro de las diferentes tecnologías de tratamiento de residuos sólidos aplicables al contexto colombiano, aquella con mayor relación en cuanto al costo y al beneficio de su implementación en función de las necesidades y objetivos del usuario y de consideraciones técnicas, financieras y ambientales. "]
[]
["INSTRUCCIONES"]
[]
["Para correr el Modelo, el usuario deberá seguir las siguientes instrucciones:\n1) En caso de que haya una alerta de seguridad acerca de las macros en la parte superior de la pantalla, hacer click en \"Habilitar contenido\".\n2) Ingresar la información solicitada en la pestaña \"Datos de entrada\". Esta secciòn representa el insumo principal del modelo la cual se debe completar segùn se indica.\n3) Revisar las salidas del Modelo y los análisis presentados en la pestaña \"Resultados\". En esta secciòn se genera el archivo .pdf de los resultados generados.\n4) La herramienta cuenta con un manual anexo el cual explica en mayor detalle los datos de entrada y los resultados obtenidos. "]
[]
["LECTURA DE RESULTADOS"]
["1) Para conocer más sobre la normativa y criterios para la implementación de la actividad de tratamiento y de los PGIRS, diríjase a la página web del Ministerio de Vivienda, Ciudad y Territorio https://www.minvivienda.gov.co/viceministerio-de-agua-y-saneamiento-basico \n2) El análisis presentado a continuación debe interpretarse como un abrebocas para la planeación y estructuración de proyectos de tratamiento de residuos sólidos. \n3) Los cálculos de costos, desviación de residuos, reducción de emisiones y demás son realizados con base en información de referencia que deberá revisarse en caso de que se decida avanzar con el proyecto.\n4) Inicialmente se presentan los aspectos del mercado a atender así como información general del proyecto. Luego se presenta el escenario identificado para el municipio donde se planea levantar la infraestructura del proyecto y la favorabilidad de desarrollar proyectos de tratamiento en su jurisdicción. Finalmente se presentan las tres (3) tecnologías evaluadas como más adecuadas para el proyecto analizado así como una estimación de los costos incurridos en su implementación, la cantidad de residuos desviados de la disposición final en rellenos sanitarios y el porcentaje de reducción de Gases de Efecto Invernadero logrado.\n5) Exportación de los resultados en formato PDF."]

{"sheet":"Datos de entrada","index":2,"n_rows":61,"n_cols":6,"rows_kept":61,"cut":false,"hidden":false,"merged":[[0,0,0,1],[1,0,1,1],[36,0,36,1],[51,0,51,1],[2,0,2,1],[16,0,16,1],[22,0,22,1],[23,0,23,1],[29,0,29,1],[43,0,43,1]]}
["DATOS DE ENTRADA",null,null,null,null,"Obligatoriedad datos"]
["1) En esta pestaña, el usuario del modelo deberá ingresar la información solicitada por el modelo para identificar la favorabilidad de implementar un sistema de tratamiento de residuos sólidos. \n2) Si se desea modelar un proyecto regional (donde se traten los residuos sólidos de dos o más municipios), se deberá seleccionar un municipio principal y serán los datos de este municipio los ingresados en las diferentes secciones, a menos que el modelo indique lo contrario. Este debe ser seleccionado en función a la cantidad de residuos generados, por ser el lugar donde se construirá la infraestructura del proyecto o por ser el municipio clave en los aspectos administrativos y gerenciales del proyecto. En el caso de un proyecto local la información a ingresar es la del municipio evaluado.\n3) La información solicitada se divide en las siguientes cuatro (4) categorías:\n    Información general: Datos para identificar el mercado a atender por el sistema de tratamiento de residuos y otros datos del proyecto evaluado.\n    Capacidad administrativa: Indicadores relacionados a la robuztes institucional del municipio (o municipio principal).\n    Capacidad técnica: Indicadores relacionados al estado de la separación en la fuente, la recolección y transporte de residuos, la disposición final y el uso del suelo en el municipio (o municipio principal).\n    Capacidad económica: Indicadores relacionados con la disponibilidad de recursos para el desarrollo del proyecto en el municipio (o municipio principal).\n4) Algunas casillas incluyen una breve descripción aclaratoria del alcance de la información solicitada, así como dónde puede ser encontrada y la obligatoriedad de su diligenciamiento para claridad del usuario. \nAquellos datos de entrada con carácter OPCIONAL que no sean ingresados por el usuario serán estimados por el modelo. "]
["Información General",null,null,null,null,"Obligatoriedad datos"]
["Información","Valor"]
["Año de inicio de operaciones",2022]
["Proyecto Regional","Si",null,null,{"$f":"+IF(B6=\"\",\"No\",1)","v":1},"Si"]
["Población beneficiada",null,"revisar en donde se toma esta informacion",null,{"$f":"+IF(B7>0,1,2)","v":2},"Si, puede que el usuario no lo ingrese pero la herramienta lo calcula"]
["Vida Útil del proyecto (años)",25]
["Generación de residuos per cápita (kg-habitante-día)",0.65,null,null,{"$f":"+IF(B9>0,1,2)","v":1},"Si, si el usuario no lo ingresa, la herramienta usa como referencia 0,76 kg-hab-día"]
["Porcentaje de residuos orgánicos",0.6,null,null,{"$f":"+IF(B10>0,1,2)","v":1},"Si, puede que el usuario no lo ingrese pero la herramienta lo calcula"]
["Tratamiento de residuos orgánicos provenientes de plazas de mercado y centrales de abasto no incluidos anteriormente","No",null,null,{"$f":"+IF(B11=\"\",\"No\",1)","v":1},"Si"]
["Cantidad (ton/año)"]
["Tratamiento de residuos orgánicos provenientes de las actividades de poda de árboles y corte de césped no incluidos anteriormente","No",null,null,{"$f":"+IF(OR(B11=\"Si\",B13=\"Si\"),\"1\",\"0\")","v":"0"},"Condicional para desplegar analisis en resultados"]
["Cantidad (ton/año)"]
["Municipio principal","HUILA - PITALITO"]
["Si el proyecto es regional, haga click aquí para ingresar los demás municipios atendidos"]
["Capacidad administrativa"]
["Indicador","Valor"]
["Medición de Desempeño Municipal","Satisfactorio",null,null,{"$f":"+IF(B19>0,1,\"No\")","v":1},"Si"]
["Municipio afectado por el conflicto armado","Si"]
["Categoría Municipal (Ley 617 de 2000)","Cuarta",null,null,{"$f":"+IF(B21>0,1,\"No\")","v":1},"Si"]
["Existencia de PGIRS actualizado en el municipio principal","Si",null,null,{"$f":"+IF(B22>0,1,\"No\")","v":1},"Si"]
["Capacidad Técnica"]
["Separación en la fuente"]
["Indicador","Valor"]
["¿Existen rutas selectivas de residuos aprovechables?","Si",null,null,{"$f":"+IF(B26>0,1,\"No\")","v":1},"Si"]
["¿Existe separación de los residuos orgánicos en la fuente?","Si",null,null,{"$f":"+IF(B27>0,1,\"No\")","v":1},"Si"]
["¿Existe separación de los residuos inorgánicos en la fuente?","Si",null,null,{"$f":"+IF(B28>0,1,2)","v":1},"No"]
["Línea base de las actividades de poda de árboles y coste de césped está actualizada","no",null,null,{"$f":"+IF(B29>0,1,\"No\")","v":1},"Si"]
["Recolección y transporte"]
["Indicador","Valor"]
["Cobertura en la recolección y transporte de residuos en el área urbana (%)","Superior al 90%",null,null,{"$f":"+IF(B32>0,1,\"No\")","v":1},"Si"]
["Cobertura en la recolección y transporte de residuos en el área rural (%)","Entre el 50% y el 75%",null,null,{"$f":"+IF(B33>0,1,\"No\")","v":1},"Si"]
["Distancia a sitio de disposición final desde el centroide del municipio principal (km)",2]
["Distancia a sitio de disposición final desde el centroide del municipio principal",{"$f":"IF(B34<10,Ponderaciones!$D$49,IF(B34<20,Ponderaciones!$D$50,IF(B34<50,Ponderaciones!$D$51,IF(B34<100,Ponderaciones!$D$52,Ponderaciones!$D$53))))","v":"Menor a 10 km"},null,null,{"$f":"+IF(B35>0,1,\"No\")","v":1},"Si"]
["Estado de las vías hasta el sitio de disposición final","Tramo mayoritariamente despavimentado, fácil acceso",null,null,{"$f":"+IF(B36>0,1,\"No\")","v":1},"Si"]
["Tratamiento y disposición final"]
["Indicador","Valor"]
["Tipo de sitio de disposición final","Relleno Sanitario",null,null,{"$f":"+IF(B39>0,1,\"No\")","v":1},"Si"]
["El sitio de disposición final, ¿es regional?","Si",null,null,{"$f":"+IF(B40>0,1,\"No\")","v":1},"Si"]
["Años de operación del sitio de disposición final","Más de 20 años",null,null,{"$f":"+IF(B41>0,1,\"No\")","v":1},"Si"]
["Vida útil del sitio de disposición final","Entre 5 y 10 años ",null,null,{"$f":"+IF(B42>0,1,\"No\")","v":1},"Si"]
["El sitio de disposición final, ¿cuenta con sistema de extracción y aprovechamiento de biogás?","No cuenta con sistema de extracción del biogás",null,null,{"$f":"+IF(B43>0,1,\"No\")","v":1},"Si"]
["Uso de suelo"]
["Indicador","Valor"]
["Existencia de polígonos para la edificación de infraestructura del servicio público de aseo en el instrumento de planeación territorial (EOT, PBOT, POT)","Si",null,null,{"$f":"+IF(B46>0,1,\"No\")","v":1},"Si"]
["Existencia de áreas ya impactadas por las actividades de disposición final y transferencia","Si",null,null,{"$f":"+IF(B47>0,1,\"No\")","v":1},"Si"]
["Existencia de suelos urbanos con actividades definidas como industriales de alto impacto","No",null,null,{"$f":"+IF(B48>0,1,\"No\")","v":1},"Si"]
["Existencia de suelos de expansión y rurales sin restricciones ambientales y debidamente recogidas en la cartografía oficial","Si",null,null,{"$f":"+IF(B49>0,1,\"No\")","v":1},"Si"]
["¿La infraestructura de tratamiento va a ubicarse en el mismo sitio del actual relleno sanitario?","Si"]
["Distancia a sitio de tratamiento desde el centroide del municipio principal (km)",2]
["Capacidad económica"]
["Indicador","Valor"]
["¿Es viable el programa de aprovechamiento conforme lo establecido en el PGIRS del municipio principal?","No",null,null,{"$f":"+IF(B54>0,1,\"No\")","v":1},"Si"]
["Recursos del Formulario Único Territorial (FUT) destinados por la entidad territorial para financiar el tratamiento de residuos sólidos","No",null,null,{"$f":"+IF(B55>0,1,\"No\")","v":1},"Si"]
["Índice de pobreza multidimensional","Entre el 10% y el 25%",null,null,{"$f":"+IF(B56>0,1,\"No\")","v":1},"Si"]
["Eficiencia en el recaudo","Entre el 50% y el 75%"]
["¿Requiere adquirir el predio para el levantamiento de la infraestructura?","No"]
["Recursos estimados por tarifa del servicio público de aseo para el tratamiento de residuos (COP/ton)",70000,null,null,{"$f":"+IF(B59>0,1,2)","v":1}]
[null,null,null,null,1]
["Tasa de Cambio \nDólares americanos (USD) a Pesos Colombianos (COP)",3800]

{"sheet":"Municipios Proyecto Regional","index":3,"n_rows":121,"n_cols":2,"rows_kept":121,"cut":false,"hidden":true,"merged":[]}
["N°","Municipios atendidos proyecto regional"]
[1,"Huila - acevedo"]
[2,"huila - elías"]
[3,"Huila - Isnos"]
[4,"Huila - Palestina"]
[5,"Huila - Oporapa"]
[6,"Huila - Saladoblanco"]
[7,"Huila - San Agustín"]
[8,"Huila - Timaná"]
[9]
[10]
[11]
[12]
[13]
[14]
[15]
[16]
[17]
[18]
[19]
[20]
[21]
[22]
[23]
[24]
[25]
[26]
[27]
[28]
[29]
[30]
[31]
[32]
[33]
[34]
[35]
[36]
[37]
[38]
[39]
[40]
[41]
[42]
[43]
[44]
[45]
[46]
[47]
[48]
[49]
[50]
[51]
[52]
[53]
[54]
[55]
[56]
[57]
[58]
[59]
[60]
[61]
[62]
[63]
[64]
[65]
[66]
[67]
[68]
[69]
[70]
[71]
[72]
[73]
[74]
[75]
[76]
[77]
[78]
[79]
[80]
[81]
[82]
[83]
[84]
[85]
[86]
[87]
[88]
[89]
[90]
[91]
[92]
[93]
[94]
[95]
[96]
[97]
[98]
[99]
[100]
[101]
[102]
[103]
[104]
[105]
[106]
[107]
[108]
[109]
[110]
[111]
[112]
[113]
[114]
[115]
[116]
[117]
[118]
[119]
[120]

{"sheet":"Resultados","index":4,"n_rows":367,"n_cols":3,"rows_kept":367,"cut":false,"hidden":false,"merged":[[362,0,362,1],[364,0,364,2],[366,0,366,1],[81,1,81,2],[140,1,140,2],[198,1,198,2],[354,0,354,1],[355,0,355,1],[356,0,356,1],[357,0,357,1],[358,0,358,1],[359,0,359,1],[360,0,360,1],[361,0,361,1],[342,0,342,1],[343,0,343,1],[344,0,344,1],[345,0,345,1],[346,0,346,1],[347,0,347,1],[348,0,348,1],[352,0,352,2],[335,0,335,1],[336,0,336,1],[337,0,337,1],[338,0,338,1],[339,0,339,1],[340,0,340,1],[341,0,341,1],[333,0,333,2],[349,0,349,1],[326,0,326,2],[328,0,328,1],[331,1,331,2],[323,0,323,1],[324,0,324,1],[301,0,301,1],[302,0,302,1],[303,0,303,1],[304,0,304,1],[305,0,305,1],[306,0,306,1],[307,0,307,1],[318,0,318,1],[319,0,319,1],[320,0,320,1],[321,0,321,1],[322,0,322,1],[308,0,308,1],[309,0,309,1],[310,0,310,1],[311,0,311,1],[312,0,312,1],[314,0,314,2],[316,0,316,1],[317,0,317,1],[297,0,297,2],[299,0,299,1],[300,0,300,1],[175,0,175,1],[176,0,176,1],[177,0,177,1],[152,0,152,1],[159,0,159,1],[295,1,295,2],[197,1,197,2],[199,1,199,2],[202,0,202,2],[191,1,191,2],[192,1,192,2],[193,1,193,2],[194,1,194,2],[195,1,195,2],[161,0,161,1],[166,0,166,2],[168,0,168,1],[169,0,169,1],[170,0,170,1],[171,0,171,1],[172,0,172,1],[65,0,65,2],[283,0,284,2],[292,1,292,2],[286,0,286,2],[83,1,83,2],[142,1,142,2],[200,1,200,2],[235,0,235,1],[236,0,236,1],[238,0,238,2],[240,0,240,1],[206,0,206,1],[207,0,207,1],[208,0,208,1],[209,0,209,1],[210,0,210,1],[211,0,211,1],[212,0,212,1],[184,1,184,2],[186,1,186,2],[187,1,187,2],[189,1,189,2],[190,1,190,2],[196,1,196,2],[173,0,173,1],[232,0,232,1],[233,0,233,1],[234,0,234,1],[213,0,213,1],[214,0,214,1],[215,0,215,1],[216,0,216,1],[217,0,217,1],[218,0,218,1],[219,0,219,1],[220,0,220,1],[224,0,224,2],[188,1,188,2],[180,0,180,2],[182,0,182,1],[226,0,226,1],[227,0,227,1],[228,0,228,1],[229,0,229,1],[230,0,230,1],[231,0,231,1],[204,0,204,1],[205,0,205,1],[98,0,98,1],[99,0,99,1],[100,0,100,1],[141,1,141,2],[144,0,144,2],[162,0,162,1],[107,0,107,2],[109,0,109,1],[111,0,111,1],[149,0,149,1],[139,1,139,2],[138,1,138,2],[129,1,129,2],[131,1,131,2],[132,1,132,2],[133,1,133,2],[137,1,137,2],[153,0,153,1],[154,0,154,1],[155,0,155,1],[156,0,156,1],[157,0,157,1],[158,0,158,1],[160,0,160,1],[174,0,174,1],[178,0,178,1],[8,0,9,2],[27,1,27,2],[28,1,28,2],[29,1,29,2],[30,1,30,2],[31,1,31,2],[32,1,32,2],[21,0,22,2],[24,0,24,2],[26,1,26,2],[11,0,11,2],[54,0,55,2],[57,0,57,2],[48,0,49,2],[51,0,51,2],[34,0,34,2],[44,0,45,0],[36,0,36,1],[37,0,37,1],[38,0,38,1],[39,0,39,1],[40,0,40,1],[41,0,41,1],[273,0,273,2],[269,0,269,2],[59,1,59,2],[60,1,60,2],[61,1,61,2],[62,1,62,2],[242,0,243,2],[245,0,245,2],[247,0,247,2],[249,0,267,2],[271,0,271,2],[95,0,95,1],[88,0,88,1],[126,1,126,2],[128,1,128,2],[135,1,135,2],[136,1,136,2],[150,0,150,1],[151,0,151,1],[146,0,146,1],[147,0,147,1],[148,0,148,1],[97,0,97,1],[70,1,70,2],[72,1,72,2],[74,1,74,2],[87,0,87,1],[69,1,69,2],[96,0,96,1],[76,1,76,2],[73,1,73,2],[75,1,75,2],[77,1,77,2],[79,1,79,2],[92,0,92,1],[93,0,93,1],[94,0,94,1],[89,0,89,1],[90,0,90,1],[91,0,91,1],[71,1,71,2],[130,1,130,2],[5,0,6,2],[78,1,78,2],[80,1,80,2],[82,1,82,2],[134,1,134,2],[64,0,64,2],[67,1,67,2],[101,0,101,1],[102,0,102,1],[123,0,123,1],[121,0,121,2],[117,0,117,1],[118,0,118,1],[119,0,119,1],[112,0,112,1],[113,0,113,1],[114,0,114,1],[115,0,115,1],[116,0,116,1],[103,0,103,1],[110,0,110,1],[42,0,42,1],[43,0,43,1],[85,0,85,2]]}
[]
[]
[]
[]
[]
["ANALISIS CONSOLIDADO DE RESULTADOS PARA LA TOMA DE DECISIONES"]
[]
[]
["ASPECTOS DEL MERCADO A ATENDER"]
[]
[]
["Aquí se presenta el tamaño del proyecto a implementar en función de su población atendida y de la cantidad de residuos sólidos a la que puede dar tratamiento."]
[]
["Variable","Descripción","Resultado"]
["Tipo de proyecto","Indica si el proyecto atiende a un municipio (Local) o a varios (Regional)",{"$f":"IF('Datos de entrada'!$B$6=Listas!$E$2,\"Regional\",\"Local\")","v":"Regional"}]
["Población beneficiada","Cantidad de habitantes beneficiados con la ejecución del proyecto.",{"$f":"Cálculo!$B$124","v":313629}]
["Población beneficiada a futuro","Cantidad de habitantes beneficiados con la ejecución del proyecto al inicio de la operación",{"$f":"+Cálculo!B125","v":321216.47334604803}]
["Residuos sólidos domiciliarios (ton/año)","Cantidad de residuos generados por los habitantes a atender, diferentes de aquellos generados en plazas de mercado, centrales de abasto o aquellos provenientes de la poda de árboles y corte de césped. Expresado en toneladas anuales.",{"$f":"Cálculo!$B$126","v":76208.608301349901}]
["Residuos sólidos  orgánicos (ton/año)","Fracción orgánica de los residuos sólidos domiciliarios proveniente principalmente de residuos de alimentos, residuos vegetales. Expresado en toneladas anuales.",{"$f":"+Cálculo!$B$127","v":45725.164980809939}]
["Municipio principal","Municipio seleccionado en función a la cantidad de residuos generados, por ser el lugar donde se construirá la infraestructura del proyecto o por ser el municipio clave en los aspectos administrativos y gerenciales del proyecto. y utilizado como referente para la entrada de datos del modelo.",{"$f":"'Datos de entrada'!$B$15","v":"HUILA - PITALITO"}]
[]
["IDENTIFICACIÓN DEL ESCENARIO DE FACTIBILIDAD"]
[]
[]
["Aquí se presenta el escenario para la implementación de una o varias tecnologías de tratamiento de residuos sólidos en el que se encuentra el municipio en donde se pretende construir el proyecto de conformidad con la información suministrada. Cada escenario indica un nivel de favorabilidad para el desarrollo de proyectos de tratamiento de residuos sólidos, tal como se presenta en la siguiente tabla."]
[]
["Escenario","Nivel de favorabilidad"]
[1,"Muy alto"]
[2,"Alto"]
[3,"Medio"]
[4,"Moderado"]
[5,"Bajo"]
[6,"Muy bajo"]
[]
[{"$f":"\"El modelo utiliza la informacion suministrada en los aspectos de capacidad administrativa, capacidad técnica y capacidad económica para establecer el escenario del municipio principal. Así las cosas, el escenario en el que se encuentra \" &$C$20 & \" es el siguiente:\"","v":"El modelo utiliza la informacion suministrada en los aspectos de capacidad administrativa, capacidad técnica y capacidad económica para establecer el escenario del municipio principal. Así las cosas, el escenario en el que se encuentra HUILA - PITALITO es el siguiente:"}]
[]
["Aspecto",null,"Aspecto"]
["Capacidad Administrativa",null,{"$f":"Cálculo!C134","v":"Media"}]
["Capacidad Técnica",null,{"$f":"Cálculo!C135","v":"Alta"}]
["Separación en la fuente",null,{"$f":"Cálculo!C136","v":"Media"}]
["Recolección y transporte",null,{"$f":"Cálculo!C137","v":"Alta"}]
["Tratamiento y disposición final",null,{"$f":"Cálculo!C138","v":"Media"}]
["Uso de suelo",null,{"$f":"Cálculo!C139","v":"Alta"}]
["Capacidad Económica",null,{"$f":"Cálculo!C140","v":"Media"}]
["Resultado","Escenario",{"$f":"Cálculo!$B$142","v":2}]
[null,"Nivel de favorabilidad",{"$f":"VLOOKUP($C$45,$A$28:$C$33,2,FALSE)","v":"Alto"}]
[]
[]
["¿ES RECOMENDABLE DESARROLLAR UN PROYECTO DE TRATAMIENTO DE RESIDUOS SÓLIDOS?"]
[]
[]
[{"$f":"Cálculo!$B$145","v":"Dado el contexto del proyecto, es recomendable continuar con las siguientes fases de planeación para el tratamiento de residuos sólidos órganicos implementando una o la combinación de las tecnologías identificadas en este reporte. Las alternativas contempladas se basan en tecnologías probadas (el análisis de tecnologias no convencionales deberá tener el cuenta lo establecido en el reglamento técnico para el sector de agua potable y saneamiento RAS)."}]
[]
[]
[{"$f":"IF(OR($C$45=1,$C$45=2,$C$45=3,'Datos de entrada'!$B$36=Ponderaciones!$G$49),\"TECNOLOGÍAS DE TRATAMIENTO DE RESIDUOS SÓLIDOS ÓRGANICOS VIABLES A NIVEL DE PREFACTIBILIDAD. \",\".\")","v":"TECNOLOGÍAS DE TRATAMIENTO DE RESIDUOS SÓLIDOS ÓRGANICOS VIABLES A NIVEL DE PREFACTIBILIDAD. "}]
[]
[]
[{"$f":"IF(OR($C$45=1,$C$45=2,$C$45=3,'Datos de entrada'!$B$36=Ponderaciones!$G$49),IF('Datos de entrada'!B6=\"No\",\"Para el tratamiento de residuos sólidos órganicos en \"&$C$20&\" las tecnologias que se recomiendan evaluar en la siguiente fase de factibilidad son:\",\"En la siguiente fase de factibilidad  regional se recomienda la evaluación  de las siguientes tecnologías de tratamiento de residuos sólidos órganicos aplicado en los municipios: \"&$C$20&IF(Cálculo!D3>0,\", \"&Cálculo!A3,\"\")&IF(Cálculo!D4>0,\", \"&Cálculo!A3,\"\")&IF(Cálculo!D5>0,\", \"&Cálculo!A5,\"\")&IF(Cálculo!D6>0,\", \"&Cálculo!A6,\"\")&IF(Cálculo!D7>0,\", \"&Cálculo!A7,\"\")&IF(Cálculo!D8>0,\", \"&Cálculo!A8,\"\")&IF(Cálculo!D9>0,\", \"&Cálculo!A9,\"\")&IF(Cálculo!D10>0,\", \"&Cálculo!A10,\"\")&IF(Cálculo!D11>0,\", \"&Cálculo!A11,\"\")&IF(Cálculo!D12>0,\", \"&Cálculo!A12,\"\")&IF(Cálculo!D13>0,\", \"&Cálculo!A13,\"\")&IF(Cálculo!D14>0,\", \"&Cálculo!A14,\"\")&IF(Cálculo!D15>0,\", \"&Cálculo!A15,\"\")&IF(Cálculo!D16>0,\", \"&Cálculo!A16,\"\")&IF(Cálculo!D17>0,\", \"&Cálculo!A17,\"\")&IF(Cálculo!D18>0,\", \"&Cálculo!A18,\"\")&IF(Cálculo!D19>0,\", \"&Cálculo!A19,\"\")&IF(Cálculo!D20>0,\", \"&Cálculo!A20,\"\")&IF(Cálculo!D21>0,\", \"&Cálculo!A21,\"\")&IF(Cálculo!D22>0,\", \"&Cálculo!A22,\"\")&IF(Cálculo!D23>0,\", \"&Cálculo!A23,\"\")&IF(Cálculo!D24>0,\", \"&Cálculo!A24,\"\")&IF(Cálculo!D25>0,\", \"&Cálculo!A25,\"\")&IF(Cálculo!D26>0,\", \"&Cálculo!A26,\"\")&IF(Cálculo!D27>0,\", \"&Cálculo!A27,\"\")&IF(Cálculo!D28>0,\", \"&Cálculo!A28,\"\")&IF(Cálculo!D29>0,\", \"&Cálculo!A29,\"\")&IF(Cálculo!D30>0,\", \"&Cálculo!A30,\"\")))&\".\"","v":"En la siguiente fase de factibilidad  regional se recomienda la evaluación  de las siguientes tecnologías de tratamiento de residuos sólidos órganicos aplicado en los municipios: HUILA - PITALITO, Huila - acevedo, Huila - acevedo, Huila - Isnos, Huila - Palestina, Huila - Oporapa, Huila - Saladoblanco, Huila - San Agustín, Huila - Timaná."}]
[]
[{"$f":"IF(OR($C$45=1,$C$45=2,$C$45=3,'Datos de entrada'!$B$36=Ponderaciones!$G$49),\"N°\",\".\")","v":"N°"},{"$f":"IF(OR($C$45=1,$C$45=2,$C$45=3,'Datos de entrada'!$B$36=Ponderaciones!$G$49),\"Tecnología recomendada\",\".\")","v":"Tecnología recomendada"}]
[{"$f":"IF(OR($C$45=1,$C$45=2,$C$45=3,'Datos de entrada'!$B$36=Ponderaciones!$G$49),Cálculo!A168,\".\")","v":1},{"$f":"IF(OR($C$45=1,$C$45=2,$C$45=3,'Datos de entrada'!$B$36=Ponderaciones!$G$49),Cálculo!C168,\".\")","v":"Compostaje en pilas con volteo manual"}]
[{"$f":"IF(OR($C$45=1,$C$45=2,$C$45=3,'Datos de entrada'!$B$36=Ponderaciones!$G$49),Cálculo!A169,\".\")","v":2},{"$f":"IF(OR($C$45=1,$C$45=2,$C$45=3,'Datos de entrada'!$B$36=Ponderaciones!$G$49),Cálculo!C169,\".\")","v":"Tratamiento Mecánico Biológico"}]
[{"$f":"IF(OR($C$45=1,$C$45=2,$C$45=3,'Datos de entrada'!$B$36=Ponderaciones!$G$49),Cálculo!A170,\".\")","v":3},{"$f":"IF(OR($C$45=1,$C$45=2,$C$45=3,'Datos de entrada'!$B$36=Ponderaciones!$G$49),Cálculo!C170,\".\")","v":"Compostaje en pilas con aireación forzada"}]
[]
[{"$f":"IF(OR($C$45=1,$C$45=2,$C$45=3,'Datos de entrada'!$B$36=Ponderaciones!$G$49),\"Así mismo, se presenta una estimación de los costos de inversión y operación en los que incurre cada tecnología. \",\".\")","v":"Así mismo, se presenta una estimación de los costos de inversión y operación en los que incurre cada tecnología. "}]
[{"$f":"IF(OR($C$45=1,$C$45=2,$C$45=3,'Datos de entrada'!$B$36=Ponderaciones!$G$49),\"Es importante destacar que los costos de inversión y operación no incluyen los relacionados con el terreno para la costrucción de la planta.\",\".\")","v":"Es importante destacar que los costos de inversión y operación no incluyen los relacionados con el terreno para la costrucción de la planta."}]
[]
[{"$f":"IF(OR($C$45=1,$C$45=2,$C$45=3,'Datos de entrada'!$B$36=Ponderaciones!$G$49),\"Tecnología 1\",\".\")","v":"Tecnología 1"},{"$f":"IF(OR($C$45=1,$C$45=2,$C$45=3,'Datos de entrada'!$B$36=Ponderaciones!$G$49),$B$61,\".\")","v":"Compostaje en pilas con volteo manual"}]
[]
[{"$f":"IF(OR($C$45=1,$C$45=2,$C$45=3,'Datos de entrada'!$B$36=Ponderaciones!$G$49),\"Variable\",\".\")","v":"Variable"},{"$f":"IF(OR($C$45=1,$C$45=2,$C$45=3,'Datos de entrada'!$B$36=Ponderaciones!$G$49),\"Descripción\",\".\")","v":"Descripción"}]
[{"$f":"IF(OR($C$45=1,$C$45=2,$C$45=3,'Datos de entrada'!$B$36=Ponderaciones!$G$49),'Interpretación de Resultados'!A2,\".\")","v":"Descripción"},{"$f":"IF(OR($C$45=1,$C$45=2,$C$45=3,'Datos de entrada'!$B$36=Ponderaciones!$G$49),VLOOKUP(B68,'Fichas técnicas Tecnologías'!$A$3:$K$10,2,FALSE),\".\")","v":"Descomposición de la materia orgánica por microorganismos en condiciones aerobias, llevada a cabo en montículos de RSO bajo condiciones controladas y cuyos requerimientos de oxígeno son alcanzados mezclando las pilas frecuentemente."}]
[{"$f":"IF(OR($C$45=1,$C$45=2,$C$45=3,'Datos de entrada'!$B$36=Ponderaciones!$G$49),'Interpretación de Resultados'!A3,\".\")","v":"Escala y capacidad óptima (ton/año)"},{"$f":"IF(OR($C$45=1,$C$45=2,$C$45=3,'Datos de entrada'!$B$36=Ponderaciones!$G$49),VLOOKUP(B68,'Fichas técnicas Tecnologías'!$A$3:$K$10,9,FALSE),\".\")","v":"Compost"}]
[{"$f":"IF(OR($C$45=1,$C$45=2,$C$45=3,'Datos de entrada'!$B$36=Ponderaciones!$G$49),'Interpretación de Resultados'!A4,\".\")","v":"Complejidad"},{"$f":"IF(OR($C$45=1,$C$45=2,$C$45=3,'Datos de entrada'!$B$36=Ponderaciones!$G$49),VLOOKUP(B68,'Fichas técnicas Tecnologías'!$A$3:$K$10,3,FALSE),\".\")","v":"1000 - 200000 "}]
[{"$f":"IF(OR($C$45=1,$C$45=2,$C$45=3,'Datos de entrada'!$B$36=Ponderaciones!$G$49), \"Considerar\",\".\")","v":"Considerar"},{"$f":"IF(OR($C$45=1,$C$45=2,$C$45=3,'Datos de entrada'!$B$36=Ponderaciones!$G$49),VLOOKUP(B68,'Fichas técnicas Tecnologías'!$A$3:$K$10,4,FALSE),\".\")","v":"Dado que el proyecto busca dar tratamiento a aproximadamente a 45725 toneladas anuales de residuos orgánicos, cuenta con una escala adecuada para implementar la tecnología"}]
[{"$f":"IF(OR($C$45=1,$C$45=2,$C$45=3,'Datos de entrada'!$B$36=Ponderaciones!$G$49),'Interpretación de Resultados'!A5,\".\")","v":"Tipo de residuos tratados"},{"$f":"IF(OR($C$45=1,$C$45=2,$C$45=3,'Datos de entrada'!$B$36=Ponderaciones!$G$49),VLOOKUP(B68,'Fichas técnicas Tecnologías'!$A$3:$K$10,5,FALSE),\".\")","v":"Baja-media"}]
[{"$f":"IF(OR($C$45=1,$C$45=2,$C$45=3,'Datos de entrada'!$B$36=Ponderaciones!$G$49), \"Considerar\",\".\")","v":"Considerar"},{"$f":"IF(OR($C$45=1,$C$45=2,$C$45=3,'Datos de entrada'!$B$36=Ponderaciones!$G$49),VLOOKUP(B68,'Fichas técnicas Tecnologías'!$A$3:$K$10,6,FALSE),\".\")","v":"Esta tecnología no requiere personal muy tecnificado ni equipos con especificaciones técnicas elevadas.Su principal barrera se presenta por la incorrecta separación en la fuente de los residuos por parte del suscriptor.Dados las salidas obtenidas por el modelo en este aspecto se recomienda desarrollar campañas educativas que mantengan a los habitantes enterados sobre las buenas prácticas en gestión de residuos sólidos enfocados en la separación en la fuente de residuos sólidos orgánicos y en economía circular"}]
[{"$f":"IF(OR($C$45=1,$C$45=2,$C$45=3,'Datos de entrada'!$B$36=Ponderaciones!$G$49),'Interpretación de Resultados'!A6,\".\")","v":"Salidas"},{"$f":"IF(OR($C$45=1,$C$45=2,$C$45=3,'Datos de entrada'!$B$36=Ponderaciones!$G$49),VLOOKUP(B68,'Fichas técnicas Tecnologías'!$A$3:$K$10,7,FALSE),\".\")","v":"Residuos Sólidos Orgánicos (RSO)"}]
[{"$f":"IF(OR($C$45=1,$C$45=2,$C$45=3,'Datos de entrada'!$B$36=Ponderaciones!$G$49), \"Considerar\",\".\")","v":"Considerar"},{"$f":"IF(OR($C$45=1,$C$45=2,$C$45=3,'Datos de entrada'!$B$36=Ponderaciones!$G$49),VLOOKUP(B68,'Fichas técnicas Tecnologías'!$A$3:$K$10,8,FALSE),\".\")","v":"Dada que se cuenta con una separación en la fuente medianamente adecuada, es necesario fortalecerla con campañas, lo cual permitirá que los residuos destinados a tratamiento sean más homogéneos y así disminuir los costos de su adecuación para su tratamiento."}]
[{"$f":"IF(OR($C$45=1,$C$45=2,$C$45=3,'Datos de entrada'!$B$36=Ponderaciones!$G$49),'Interpretación de Resultados'!A7,\".\")","v":"Impacto ambiental"},{"$f":"IF(OR($C$45=1,$C$45=2,$C$45=3,'Datos de entrada'!$B$36=Ponderaciones!$G$49),VLOOKUP(B68,'Fichas técnicas Tecnologías'!$A$3:$K$10,11,FALSE),\".\")","v":"Olores\nRuido\nContaminación visual"}]
[{"$f":"IF(OR($C$45=1,$C$45=2,$C$45=3,'Datos de entrada'!$B$36=Ponderaciones!$G$49), \"Considerar\",\".\")","v":"Considerar"},{"$f":"IF(OR($C$45=1,$C$45=2,$C$45=3,'Datos de entrada'!$B$36=Ponderaciones!$G$49),VLOOKUP(B68,'Fichas técnicas Tecnologías'!$A$3:$N$10,12,FALSE)&VLOOKUP(B68,'Fichas técnicas Tecnologías'!$A$3:$W$10,20,FALSE),\".\")","v":"Implemente prácticas adecuadas en la operación del sistema permite evitar el impacto ambiental ocasionado. Se recomienda que revise literatura y otras experiencias sobre cómo monitorear, entre otras variables, el tamaño de las partículas, el contenido de carbono y nitrógeno, el contenido de humedad, la temperatura, el pH y la presencia de patógenos.  Algunas Corporaciones Autónomas Regionales han expedido manuales al respecto, así como entidades tales como la UAESP de Bogotá y organizaciones como ACODAL. El tamaño de la planta requiere licenciamiento ambiental, por lo tanto debe elaborar el plan de manejo ambiental y adelantar los tramites para obtenerla.Tenga presente que la tecnologia de Compostaje con volteo manual requiere mayor área frente a la tecnología con aireación forzada. Para una planta de 46000 toneladas por año se requieren de 16 hectaréas frente a un área de 13 hectareas para la segunda\"Esta tecnología presenta menor resistencia a los cambios metereológicos."}]
[{"$f":"IF(OR($C$45=1,$C$45=2,$C$45=3,'Datos de entrada'!$B$36=Ponderaciones!$G$49),'Interpretación de Resultados'!A8,\".\")","v":"Desviación de residuos (ton/año)"},{"$f":"IF(OR($C$45=1,$C$45=2,$C$45=3,'Datos de entrada'!$B$36=Ponderaciones!$G$49),VLOOKUP(1,Cálculo!$B$156:$U$160,15,FALSE),\".\")","v":8573.468433901864}]
[{"$f":"IF(OR($C$45=1,$C$45=2,$C$45=3,'Datos de entrada'!$B$36=Ponderaciones!$G$49), \"Considerar\",\".\")","v":"Considerar"},{"$f":"IF(OR($C$45=1,$C$45=2,$C$45=3,'Datos de entrada'!$B$36=Ponderaciones!$G$49),\"La desviación de residuos se estima teniendo en cuenta la capacidad de la planta.\",\".\")","v":"La desviación de residuos se estima teniendo en cuenta la capacidad de la planta."}]
[{"$f":"IF(OR($C$45=1,$C$45=2,$C$45=3,'Datos de entrada'!$B$36=Ponderaciones!$G$49),'Interpretación de Resultados'!A9,\".\")","v":"% Reducción de GEI en comparación con su disposición final en relleno sanitario"},{"$f":"IF(OR($C$45=1,$C$45=2,$C$45=3,'Datos de entrada'!$B$36=Ponderaciones!$G$49),VLOOKUP(1,Cálculo!$B$156:$U$160,19,FALSE),\".\")","v":0.42}]
[{"$f":"IF(OR($C$45=1,$C$45=2,$C$45=3,'Datos de entrada'!$B$36=Ponderaciones!$G$49), \"Considerar\",\".\")","v":"Considerar"},{"$f":"IF(OR($C$45=1,$C$45=2,$C$45=3,'Datos de entrada'!$B$36=Ponderaciones!$G$49),IF('Datos de entrada'!$B$43=Ponderaciones!$D$77,_xlfn.CONCAT(\"Se recomienda implementar un sistema de extracción y aprovechamiento del biogás en el sitio de disposición final, \",\"para tratar los Gases de Efecto Invernadero generados por la descomposición de la materia orgánica de los residuos allí dispuestos.\",VLOOKUP(B68,'Fichas técnicas Tecnologías'!A:M,13,0)),IF('Datos de entrada'!$B$43=Ponderaciones!$D$78,_xlfn.CONCAT(\"Se recomienda implementar un sistema de aprovechamiento del biogás en el sitio de disposición final, \",\"para tratar los Gases de Efecto Invernadero generados por la descomposición de la materia orgánica de los residuos allí dispuestos.\",VLOOKUP(B68,'Fichas técnicas Tecnologías'!A:M,13,0)),\"El sistema de extracción y aprovechamiento de biogás instalado en el relleno sanitario permite la reducción de Gases de Efecto Invernadero generados por la descomposición de materia orgánica de los residuos allí dispuestos.\"&VLOOKUP(B68,'Fichas técnicas Tecnologías'!A:M,13,0))),\".\")","v":"Se recomienda implementar un sistema de extracción y aprovechamiento del biogás en el sitio de disposición final, para tratar los Gases de Efecto Invernadero generados por la descomposición de la materia orgánica de los residuos allí dispuestos. Si usted desea hacer una estimación de toneladas equivalentes de CO2 puede remitirse a la herramienta de cálculo de gases de efecto invernadero (GEI) en el manejo de residuos sólidos (MRS) en este link https://www.bivica.org/file/view/id/1081 y al https://www.ifeu.de/en/project/tool-for-calculating-greenhouse-gases-ghg-in-solid-waste-management-swm/"}]
[]
[{"$f":"IF(OR($C$45=1,$C$45=2,$C$45=3,'Datos de entrada'!$B$36=Ponderaciones!$G$49),\"Costos de inversión\",\".\")","v":"Costos de inversión"}]
[]
[{"$f":"IF(OR($C$45=1,$C$45=2,$C$45=3,'Datos de entrada'!$B$36=Ponderaciones!$G$49),IF(Cálculo!A201<>0,Cálculo!A201,\"\"),\".\")","v":"Pre-inversión"},null,{"$f":"IF(OR($C$45=1,$C$45=2,$C$45=3,'Datos de entrada'!$B$36=Ponderaciones!$G$49),IF(Cálculo!B201<>0,Cálculo!B201,\"\"),\".\")","v":""}]
[{"$f":"IF(OR($C$45=1,$C$45=2,$C$45=3,'Datos de entrada'!$B$36=Ponderaciones!$G$49),IF(Cálculo!A202<>0,Cálculo!A202,\"\"),\".\")","v":"   Estudios, Diseños "},null,{"$f":"IF(OR($C$45=1,$C$45=2,$C$45=3,'Datos de entrada'!$B$36=Ponderaciones!$G$49),IF(Cálculo!B202<>0,Cálculo!B202,\"\"),\".\")","v":126000000}]
[{"$f":"IF(OR($C$45=1,$C$45=2,$C$45=3,'Datos de entrada'!$B$36=Ponderaciones!$G$49),IF(Cálculo!A203<>0,Cálculo!A203,\"\"),\".\")","v":"   Permisos"},null,{"$f":"IF(OR($C$45=1,$C$45=2,$C$45=3,'Datos de entrada'!$B$36=Ponderaciones!$G$49),IF(Cálculo!B203<>0,Cálculo!B203,\"\"),\".\")","v":63000000}]
[{"$f":"IF(OR($C$45=1,$C$45=2,$C$45=3,'Datos de entrada'!$B$36=Ponderaciones!$G$49),IF(Cálculo!A204<>0,Cálculo!A204,\"\"),\".\")","v":"Infraestructura"},null,{"$f":"IF(OR($C$45=1,$C$45=2,$C$45=3,'Datos de entrada'!$B$36=Ponderaciones!$G$49),IF(Cálculo!B204<>0,Cálculo!B204,\"\"),\".\")","v":4007000000}]
[{"$f":"IF(OR($C$45=1,$C$45=2,$C$45=3,'Datos de entrada'!$B$36=Ponderaciones!$G$49),IF(Cálculo!A205<>0,Cálculo!A205,\"\"),\".\")","v":"Maquinaria y Equipos (incluido el costo de instalación)"},null,{"$f":"IF(OR($C$45=1,$C$45=2,$C$45=3,'Datos de entrada'!$B$36=Ponderaciones!$G$49),IF(Cálculo!B205<>0,Cálculo!B205,\"\"),\".\")","v":""}]
[{"$f":"IF(OR($C$45=1,$C$45=2,$C$45=3,'Datos de entrada'!$B$36=Ponderaciones!$G$49),IF(Cálculo!A206<>0,Cálculo!A206,\"\"),\".\")","v":"   Trommel"},null,{"$f":"IF(OR($C$45=1,$C$45=2,$C$45=3,'Datos de entrada'!$B$36=Ponderaciones!$G$49),IF(Cálculo!B206<>0,Cálculo!B206,\"\"),\".\")","v":141000000}]
[{"$f":"IF(OR($C$45=1,$C$45=2,$C$45=3,'Datos de entrada'!$B$36=Ponderaciones!$G$49),IF(Cálculo!A207<>0,Cálculo!A207,\"\"),\".\")","v":"   Minicargador"},null,{"$f":"IF(OR($C$45=1,$C$45=2,$C$45=3,'Datos de entrada'!$B$36=Ponderaciones!$G$49),IF(Cálculo!B207<>0,Cálculo!B207,\"\"),\".\")","v":244344853}]
[{"$f":"IF(OR($C$45=1,$C$45=2,$C$45=3,'Datos de entrada'!$B$36=Ponderaciones!$G$49),IF(Cálculo!A208<>0,Cálculo!A208,\"\"),\".\")","v":"   Tractor"},null,{"$f":"IF(OR($C$45=1,$C$45=2,$C$45=3,'Datos de entrada'!$B$36=Ponderaciones!$G$49),IF(Cálculo!B208<>0,Cálculo!B208,\"\"),\".\")","v":244344853}]
[{"$f":"IF(OR($C$45=1,$C$45=2,$C$45=3,'Datos de entrada'!$B$36=Ponderaciones!$G$49),IF(Cálculo!A209<>0,Cálculo!A209,\"\"),\".\")","v":"   Retroexcavadora"},null,{"$f":"IF(OR($C$45=1,$C$45=2,$C$45=3,'Datos de entrada'!$B$36=Ponderaciones!$G$49),IF(Cálculo!B209<>0,Cálculo!B209,\"\"),\".\")","v":212985085}]
[{"$f":"IF(OR($C$45=1,$C$45=2,$C$45=3,'Datos de entrada'!$B$36=Ponderaciones!$G$49),IF(Cálculo!A210<>0,Cálculo!A210,\"\"),\".\")","v":"   Montacargas"},null,{"$f":"IF(OR($C$45=1,$C$45=2,$C$45=3,'Datos de entrada'!$B$36=Ponderaciones!$G$49),IF(Cálculo!B210<>0,Cálculo!B210,\"\"),\".\")","v":151572208}]
[{"$f":"IF(OR($C$45=1,$C$45=2,$C$45=3,'Datos de entrada'!$B$36=Ponderaciones!$G$49),IF(Cálculo!A211<>0,Cálculo!A211,\"\"),\".\")","v":"   Planta electrica"},null,{"$f":"IF(OR($C$45=1,$C$45=2,$C$45=3,'Datos de entrada'!$B$36=Ponderaciones!$G$49),IF(Cálculo!B211<>0,Cálculo!B211,\"\"),\".\")","v":143732266}]
[{"$f":"IF(OR($C$45=1,$C$45=2,$C$45=3,'Datos de entrada'!$B$36=Ponderaciones!$G$49),IF(Cálculo!A212<>0,Cálculo!A212,\"\"),\".\")","v":"   Compresor"},null,{"$f":"IF(OR($C$45=1,$C$45=2,$C$45=3,'Datos de entrada'!$B$36=Ponderaciones!$G$49),IF(Cálculo!B212<>0,Cálculo!B212,\"\"),\".\")","v":35279738}]
[{"$f":"IF(OR($C$45=1,$C$45=2,$C$45=3,'Datos de entrada'!$B$36=Ponderaciones!$G$49),IF(Cálculo!A213<>0,Cálculo!A213,\"\"),\".\")","v":"   Volqueta"},null,{"$f":"IF(OR($C$45=1,$C$45=2,$C$45=3,'Datos de entrada'!$B$36=Ponderaciones!$G$49),IF(Cálculo!B213<>0,Cálculo!B213,\"\"),\".\")","v":574929065}]
[{"$f":"IF(OR($C$45=1,$C$45=2,$C$45=3,'Datos de entrada'!$B$36=Ponderaciones!$G$49),IF(Cálculo!A214<>0,Cálculo!A214,\"\"),\".\")","v":"Total Costo de Inversión Inicial"},null,{"$f":"IF(OR($C$45=1,$C$45=2,$C$45=3,'Datos de entrada'!$B$36=Ponderaciones!$G$49),IF(Cálculo!B214<>0,Cálculo!B214,\"\"),\".\")","v":5944188068}]
[{"$f":"IF(OR($C$45=1,$C$45=2,$C$45=3,'Datos de entrada'!$B$36=Ponderaciones!$G$49),IF(Cálculo!A215<>0,Cálculo!A215,\"\"),\".\")","v":""},null,{"$f":"IF(OR($C$45=1,$C$45=2,$C$45=3,'Datos de entrada'!$B$36=Ponderaciones!$G$49),IF(Cálculo!B215<>0,Cálculo!B215,\"\"),\".\")","v":""}]
[{"$f":"IF(OR($C$45=1,$C$45=2,$C$45=3,'Datos de entrada'!$B$36=Ponderaciones!$G$49),IF(Cálculo!A216<>0,Cálculo!A216,\"\"),\".\")","v":""},null,{"$f":"IF(OR($C$45=1,$C$45=2,$C$45=3,'Datos de entrada'!$B$36=Ponderaciones!$G$49),IF(Cálculo!B216<>0,Cálculo!B216,\"\"),\".\")","v":""}]
[{"$f":"IF(OR($C$45=1,$C$45=2,$C$45=3,'Datos de entrada'!$B$36=Ponderaciones!$G$49),IF(Cálculo!A217<>0,Cálculo!A217,\"\"),\".\")","v":""},null,{"$f":"IF(OR($C$45=1,$C$45=2,$C$45=3,'Datos de entrada'!$B$36=Ponderaciones!$G$49),IF(Cálculo!B217<>0,Cálculo!B217,\"\"),\".\")","v":""}]
[]
[]
[]
[{"$f":"IF(OR($C$45=1,$C$45=2,$C$45=3,'Datos de entrada'!$B$36=Ponderaciones!$G$49),\"Costos de operación\",\".\")","v":"Costos de operación"}]
[]
[{"$f":"IF(OR($C$45=1,$C$45=2,$C$45=3,'Datos de entrada'!$B$36=Ponderaciones!$G$49),IF(Cálculo!D201<>0,Cálculo!D201,\"\"),\".\")","v":"Energia"},null,{"$f":"IF(OR($C$45=1,$C$45=2,$C$45=3,'Datos de entrada'!$B$36=Ponderaciones!$G$49),IF(Cálculo!E201<>0,Cálculo!E201,\"\"),\".\")","v":63000000}]
[{"$f":"IF(OR($C$45=1,$C$45=2,$C$45=3,'Datos de entrada'!$B$36=Ponderaciones!$G$49),IF(Cálculo!D202<>0,Cálculo!D202,\"\"),\".\")","v":"Combustible"},null,{"$f":"IF(OR($C$45=1,$C$45=2,$C$45=3,'Datos de entrada'!$B$36=Ponderaciones!$G$49),IF(Cálculo!E202<>0,Cálculo!E202,\"\"),\".\")","v":242000000}]
[{"$f":"IF(OR($C$45=1,$C$45=2,$C$45=3,'Datos de entrada'!$B$36=Ponderaciones!$G$49),IF(Cálculo!D203<>0,Cálculo!D203,\"\"),\".\")","v":"Agua "},null,{"$f":"IF(OR($C$45=1,$C$45=2,$C$45=3,'Datos de entrada'!$B$36=Ponderaciones!$G$49),IF(Cálculo!E203<>0,Cálculo!E203,\"\"),\".\")","v":8000000}]
[{"$f":"IF(OR($C$45=1,$C$45=2,$C$45=3,'Datos de entrada'!$B$36=Ponderaciones!$G$49),IF(Cálculo!D204<>0,Cálculo!D204,\"\"),\".\")","v":"Tratamiento RSO"},null,{"$f":"IF(OR($C$45=1,$C$45=2,$C$45=3,'Datos de entrada'!$B$36=Ponderaciones!$G$49),IF(Cálculo!E204<>0,Cálculo!E204,\"\"),\".\")","v":811000000}]
[{"$f":"IF(OR($C$45=1,$C$45=2,$C$45=3,'Datos de entrada'!$B$36=Ponderaciones!$G$49),IF(Cálculo!D205<>0,Cálculo!D205,\"\"),\".\")","v":"Monitoreo Ambiental "},null,{"$f":"IF(OR($C$45=1,$C$45=2,$C$45=3,'Datos de entrada'!$B$36=Ponderaciones!$G$49),IF(Cálculo!E205<>0,Cálculo!E205,\"\"),\".\")","v":4000000}]
[{"$f":"IF(OR($C$45=1,$C$45=2,$C$45=3,'Datos de entrada'!$B$36=Ponderaciones!$G$49),IF(Cálculo!D206<>0,Cálculo!D206,\"\"),\".\")","v":"Mantenimiento - Maquinaria y equipos "},null,{"$f":"IF(OR($C$45=1,$C$45=2,$C$45=3,'Datos de entrada'!$B$36=Ponderaciones!$G$49),IF(Cálculo!E206<>0,Cálculo!E206,\"\"),\".\")","v":31000000}]
[{"$f":"IF(OR($C$45=1,$C$45=2,$C$45=3,'Datos de entrada'!$B$36=Ponderaciones!$G$49),IF(Cálculo!D207<>0,Cálculo!D207,\"\"),\".\")","v":"Mantenimiento - Infraestructura "},null,{"$f":"IF(OR($C$45=1,$C$45=2,$C$45=3,'Datos de entrada'!$B$36=Ponderaciones!$G$49),IF(Cálculo!E207<>0,Cálculo!E207,\"\"),\".\")","v":36000000}]
[{"$f":"IF(OR($C$45=1,$C$45=2,$C$45=3,'Datos de entrada'!$B$36=Ponderaciones!$G$49),IF(Cálculo!D208<>0,Cálculo!D208,\"\"),\".\")","v":"Mano de Obra"},null,{"$f":"IF(OR($C$45=1,$C$45=2,$C$45=3,'Datos de entrada'!$B$36=Ponderaciones!$G$49),IF(Cálculo!E208<>0,Cálculo!E208,\"\"),\".\")","v":57000000}]
[{"$f":"IF(OR($C$45=1,$C$45=2,$C$45=3,'Datos de entrada'!$B$36=Ponderaciones!$G$49),IF(Cálculo!D209<>0,Cálculo!D209,\"\"),\".\")","v":"Valor de Operación Anual"},null,{"$f":"IF(OR($C$45=1,$C$45=2,$C$45=3,'Datos de entrada'!$B$36=Ponderaciones!$G$49),IF(Cálculo!E209<>0,Cálculo!E209,\"\"),\".\")","v":1252000000}]
[{"$f":"IF(OR($C$45=1,$C$45=2,$C$45=3,'Datos de entrada'!$B$36=Ponderaciones!$G$49),IF(Cálculo!D210<>0,Cálculo!D210,\"\"),\".\")","v":""},null,{"$f":"IF(OR($C$45=1,$C$45=2,$C$45=3,'Datos de entrada'!$B$36=Ponderaciones!$G$49),IF(Cálculo!E210<>0,Cálculo!E210,\"\"),\".\")","v":""}]
[{"$f":"IF(OR($C$45=1,$C$45=2,$C$45=3,'Datos de entrada'!$B$36=Ponderaciones!$G$49),IF(Cálculo!D211<>0,Cálculo!D211,\"\"),\".\")","v":""},null,{"$f":"IF(OR($C$45=1,$C$45=2,$C$45=3,'Datos de entrada'!$B$36=Ponderaciones!$G$49),IF(Cálculo!E211<>0,Cálculo!E211,\"\"),\".\")","v":""}]
[]
[{"$f":"IF(OR($C$45=1,$C$45=2,$C$45=3,'Datos de entrada'!$B$36=Ponderaciones!$G$49),\"Ingresos\",\".\")","v":"Ingresos"}]
[]
[{"$f":"IF(OR($C$45=1,$C$45=2,$C$45=3,'Datos de entrada'!$B$36=Ponderaciones!$G$49),Cálculo!G200,\".\")","v":"Ingresos por tarifa (COP) (Promedio Anual)"},null,{"$f":"IF(OR($C$45=1,$C$45=2,$C$45=3,'Datos de entrada'!$B$36=Ponderaciones!$G$49),Cálculo!H200,\".\")","v":3296800000}]
[]
[]
[{"$f":"IF(OR($C$45=1,$C$45=2,$C$45=3,'Datos de entrada'!$B$36=Ponderaciones!$G$49),\"Tecnología 2\",\".\")","v":"Tecnología 2"},{"$f":"IF(OR($C$45=1,$C$45=2,$C$45=3,'Datos de entrada'!$B$36=Ponderaciones!$G$49),$B$62,\".\")","v":"Tratamiento Mecánico Biológico"}]
[]
[{"$f":"IF(OR($C$45=1,$C$45=2,$C$45=3,'Datos de entrada'!$B$36=Ponderaciones!$G$49),\"Variable\",\".\")","v":"Variable"},{"$f":"IF(OR($C$45=1,$C$45=2,$C$45=3,'Datos de entrada'!$B$36=Ponderaciones!$G$49),\"Descripción\",\".\")","v":"Descripción"}]
[{"$f":"IF(OR($C$45=1,$C$45=2,$C$45=3,'Datos de entrada'!$B$36=Ponderaciones!$G$49),'Interpretación de Resultados'!A2,\".\")","v":"Descripción"},{"$f":"IF(OR($C$45=1,$C$45=2,$C$45=3,'Datos de entrada'!$B$36=Ponderaciones!$G$49),VLOOKUP(B127,'Fichas técnicas Tecnologías'!$A$3:$K$10,2,FALSE),\".\")","v":"Combinación de tratamientos físicos con tratamientos biológicos para el aprovechamiento de la fracción orgánica e inorgánica de los residuos sólidos. Esta tecnología es priorizada sobre las demás, dado los lineamientos del Plan Integral de Gestión de Cambio Climático Sectorial adoptado mediante la Resolución 431 de 2020."}]
[{"$f":"IF(OR($C$45=1,$C$45=2,$C$45=3,'Datos de entrada'!$B$36=Ponderaciones!$G$49),'Interpretación de Resultados'!A3,\".\")","v":"Escala y capacidad óptima (ton/año)"},{"$f":"IF(OR($C$45=1,$C$45=2,$C$45=3,'Datos de entrada'!$B$36=Ponderaciones!$G$49),VLOOKUP(B127,'Fichas técnicas Tecnologías'!$A$3:$K$10,9,FALSE),\".\")","v":"Compost y materiales reciclables"}]
[{"$f":"IF(OR($C$45=1,$C$45=2,$C$45=3,'Datos de entrada'!$B$36=Ponderaciones!$G$49),'Interpretación de Resultados'!A4,\".\")","v":"Complejidad"},{"$f":"IF(OR($C$45=1,$C$45=2,$C$45=3,'Datos de entrada'!$B$36=Ponderaciones!$G$49),VLOOKUP(B127,'Fichas técnicas Tecnologías'!$A$3:$K$10,3,FALSE),\".\")","v":"20000-500000"}]
[{"$f":"IF(OR($C$45=1,$C$45=2,$C$45=3,'Datos de entrada'!$B$36=Ponderaciones!$G$49), \"Considerar\",\".\")","v":"Considerar"},{"$f":"IF(OR($C$45=1,$C$45=2,$C$45=3,'Datos de entrada'!$B$36=Ponderaciones!$G$49),VLOOKUP(B127,'Fichas técnicas Tecnologías'!$A$3:$K$10,4,FALSE),\".\")","v":"Dado que el proyecto busca dar tratamiento a aproximadamente a 45725 toneladas anuales de residuos sólidos, cuenta con una escala adecuada para implementar la tecnología."}]
[{"$f":"IF(OR($C$45=1,$C$45=2,$C$45=3,'Datos de entrada'!$B$36=Ponderaciones!$G$49),'Interpretación de Resultados'!A5,\".\")","v":"Tipo de residuos tratados"},{"$f":"IF(OR($C$45=1,$C$45=2,$C$45=3,'Datos de entrada'!$B$36=Ponderaciones!$G$49),VLOOKUP(B127,'Fichas técnicas Tecnologías'!$A$3:$K$10,5,FALSE),\".\")","v":"Media-alta"}]
[{"$f":"IF(OR($C$45=1,$C$45=2,$C$45=3,'Datos de entrada'!$B$36=Ponderaciones!$G$49), \"Considerar\",\".\")","v":"Considerar"},{"$f":"IF(OR($C$45=1,$C$45=2,$C$45=3,'Datos de entrada'!$B$36=Ponderaciones!$G$49),VLOOKUP(B127,'Fichas técnicas Tecnologías'!$A$3:$K$10,6,FALSE),\".\")","v":"Esta tecnología requiere personal medianamente tecnificado para el adecuado uso de los equipos y su mantenimiento.Para su uso óptimo se requiere una adecua separación en la fuente de los residuos por parte del suscriptor, pero no es necesaria. Se recomienda desarrollar  que mantengan a los habitantes enterados sobre las buenas prácticas en gestión de residuos sólidos enfocados en la separación en la fuente de residuos sólidos orgánicos y en economía circular."}]
[{"$f":"IF(OR($C$45=1,$C$45=2,$C$45=3,'Datos de entrada'!$B$36=Ponderaciones!$G$49),'Interpretación de Resultados'!A6,\".\")","v":"Salidas"},{"$f":"IF(OR($C$45=1,$C$45=2,$C$45=3,'Datos de entrada'!$B$36=Ponderaciones!$G$49),VLOOKUP(B127,'Fichas técnicas Tecnologías'!$A$3:$K$10,7,FALSE),\".\")","v":"Residuos domiciliarios sin separar"}]
[{"$f":"IF(OR($C$45=1,$C$45=2,$C$45=3,'Datos de entrada'!$B$36=Ponderaciones!$G$49), \"Considerar\",\".\")","v":"Considerar"},{"$f":"IF(OR($C$45=1,$C$45=2,$C$45=3,'Datos de entrada'!$B$36=Ponderaciones!$G$49),VLOOKUP(B127,'Fichas técnicas Tecnologías'!$A$3:$K$10,8,FALSE),\".\")","v":"A mayor separación en la fuente mayor facilidad tienen los procesos del Tratamiento Mecánico Biológico. Dada que se cuenta con una separación en la fuente medianamente adecuada, es necesario fortalecerla con campañas, lo cual permitirá que los residuos destinados a tratamiento sean más homogéneos y así disminuir los costos de su adecuación para su tratamiento e incrementar la desviación de residuos que de otra forma irían al relleno.."}]
[{"$f":"IF(OR($C$45=1,$C$45=2,$C$45=3,'Datos de entrada'!$B$36=Ponderaciones!$G$49),'Interpretación de Resultados'!A7,\".\")","v":"Impacto ambiental"},{"$f":"IF(OR($C$45=1,$C$45=2,$C$45=3,'Datos de entrada'!$B$36=Ponderaciones!$G$49),VLOOKUP(B127,'Fichas técnicas Tecnologías'!$A$3:$K$10,11,FALSE),\".\")","v":"Olores\nRuido\nContaminación visual"}]
[{"$f":"IF(OR($C$45=1,$C$45=2,$C$45=3,'Datos de entrada'!$B$36=Ponderaciones!$G$49), \"Considerar\",\".\")","v":"Considerar"},{"$f":"IF(OR($C$45=1,$C$45=2,$C$45=3,'Datos de entrada'!$B$36=Ponderaciones!$G$49),VLOOKUP(B127,'Fichas técnicas Tecnologías'!$A$3:$N$10,12,FALSE)&VLOOKUP(B127,'Fichas técnicas Tecnologías'!$A$3:$U$10,20,FALSE),\".\")","v":"Un manejo adecuado de los residuos orgánicos permitirá evitar la generación de olores. Esto implica cortos períodos de almacenamiento para evitar su descomposición. El tamaño de la planta requiere licenciamiento ambiental, por lo tanto debe elaborar el plan de manejo ambiental y adelantar los tramites para obtenerla."}]
[{"$f":"IF(OR($C$45=1,$C$45=2,$C$45=3,'Datos de entrada'!$B$36=Ponderaciones!$G$49),'Interpretación de Resultados'!A8,\".\")","v":"Desviación de residuos (ton/año)"},{"$f":"IF(OR($C$45=1,$C$45=2,$C$45=3,'Datos de entrada'!$B$36=Ponderaciones!$G$49),VLOOKUP(2,Cálculo!$B$156:$U$160,15,FALSE),\".\")","v":27600}]
[{"$f":"IF(OR($C$45=1,$C$45=2,$C$45=3,'Datos de entrada'!$B$36=Ponderaciones!$G$49), \"Considerar\",\".\")","v":"Considerar"},{"$f":"IF(OR($C$45=1,$C$45=2,$C$45=3,'Datos de entrada'!$B$36=Ponderaciones!$G$49),\"La desviación de residuos se estima teniendo en cuenta la capacidad de la planta.\",\".\")","v":"La desviación de residuos se estima teniendo en cuenta la capacidad de la planta."}]
[{"$f":"IF(OR($C$45=1,$C$45=2,$C$45=3,'Datos de entrada'!$B$36=Ponderaciones!$G$49),'Interpretación de Resultados'!A9,\".\")","v":"% Reducción de GEI en comparación con su disposición final en relleno sanitario"},{"$f":"IF(OR($C$45=1,$C$45=2,$C$45=3,'Datos de entrada'!$B$36=Ponderaciones!$G$49),VLOOKUP(2,Cálculo!$B$156:$U$160,19,FALSE),\".\")","v":0.68}]
[{"$f":"IF(OR($C$45=1,$C$45=2,$C$45=3,'Datos de entrada'!$B$36=Ponderaciones!$G$49), \"Considerar\",\".\")","v":"Considerar"},{"$f":"IF(OR($C$45=1,$C$45=2,$C$45=3,'Datos de entrada'!$B$36=Ponderaciones!$G$49),IF('Datos de entrada'!$B$43=Ponderaciones!$D$77, _xlfn.CONCAT(\"Se recomienda implementar un sistema de extracción y aprovechamiento del biogás en el sitio de disposición final, \", \"para tratar los Gases de Efecto Invernadero generados por la descomposición de la materia orgánica de los residuos allí dispuestos.\",VLOOKUP(B127,'Fichas técnicas Tecnologías'!A:M,13,0)), IF('Datos de entrada'!$B$43=Ponderaciones!$D$78, _xlfn.CONCAT(\"Se recomienda implementar un sistema de aprovechamiento del biogás en el sitio de disposición final, \", \"para tratar los Gases de Efecto Invernadero generados por la descomposición de la materia orgánica de los residuos allí dispuestos.\",VLOOKUP(B127,'Fichas técnicas Tecnologías'!A:M,13,0)), \"El sistema de extracción y aprovechamiento de biogás instalado en el relleno sanitario permite la reducción de Gases de Efecto Invernadero generados por la descomposición de materia orgánica de los residuos allí dispuestos.\"&VLOOKUP(B127,'Fichas técnicas Tecnologías'!A:M,13,0))),\".\")","v":"Se recomienda implementar un sistema de extracción y aprovechamiento del biogás en el sitio de disposición final, para tratar los Gases de Efecto Invernadero generados por la descomposición de la materia orgánica de los residuos allí dispuestos. Si usted desea hacer una estimación de toneladas equivalentes de CO2 puede remitirse a la herramienta de cálculo de gases de efecto invernadero (GEI) en el manejo de residuos sólidos (MRS) en este link https://www.bivica.org/file/view/id/1081 y al https://www.ifeu.de/en/project/tool-for-calculating-greenhouse-gases-ghg-in-solid-waste-management-swm/"}]
[]
[{"$f":"IF(OR($C$45=1,$C$45=2,$C$45=3,'Datos de entrada'!$B$36=Ponderaciones!$G$49),\"Costos de inversión\",\".\")","v":"Costos de inversión"}]
[]
[{"$f":"IF(OR($C$45=1,$C$45=2,$C$45=3,'Datos de entrada'!$B$36=Ponderaciones!$G$49),IF(Cálculo!A248<>0,Cálculo!A248,\"\"),\".\")","v":"Pre-inversión"},null,{"$f":"IF(OR($C$45=1,$C$45=2,$C$45=3,'Datos de entrada'!$B$36=Ponderaciones!$G$49),IF(Cálculo!B248<>0,Cálculo!B248,\"\"),\".\")","v":""}]
[{"$f":"IF(OR($C$45=1,$C$45=2,$C$45=3,'Datos de entrada'!$B$36=Ponderaciones!$G$49),IF(Cálculo!A249<>0,Cálculo!A249,\"\"),\".\")","v":"   Estudios, Diseños "},null,{"$f":"IF(OR($C$45=1,$C$45=2,$C$45=3,'Datos de entrada'!$B$36=Ponderaciones!$G$49),IF(Cálculo!B249<>0,Cálculo!B249,\"\"),\".\")","v":121000000}]
[{"$f":"IF(OR($C$45=1,$C$45=2,$C$45=3,'Datos de entrada'!$B$36=Ponderaciones!$G$49),IF(Cálculo!A250<>0,Cálculo!A250,\"\"),\".\")","v":"   Permisos"},null,{"$f":"IF(OR($C$45=1,$C$45=2,$C$45=3,'Datos de entrada'!$B$36=Ponderaciones!$G$49),IF(Cálculo!B250<>0,Cálculo!B250,\"\"),\".\")","v":81000000}]
[{"$f":"IF(OR($C$45=1,$C$45=2,$C$45=3,'Datos de entrada'!$B$36=Ponderaciones!$G$49),IF(Cálculo!A251<>0,Cálculo!A251,\"\"),\".\")","v":"Infraestructura"},null,{"$f":"IF(OR($C$45=1,$C$45=2,$C$45=3,'Datos de entrada'!$B$36=Ponderaciones!$G$49),IF(Cálculo!B251<>0,Cálculo!B251,\"\"),\".\")","v":811000000}]
[{"$f":"IF(OR($C$45=1,$C$45=2,$C$45=3,'Datos de entrada'!$B$36=Ponderaciones!$G$49),IF(Cálculo!A252<>0,Cálculo!A252,\"\"),\".\")","v":"Maquinaria y Equipos (incluido el costo de instalación)"},null,{"$f":"IF(OR($C$45=1,$C$45=2,$C$45=3,'Datos de entrada'!$B$36=Ponderaciones!$G$49),IF(Cálculo!B252<>0,Cálculo!B252,\"\"),\".\")","v":""}]
[{"$f":"IF(OR($C$45=1,$C$45=2,$C$45=3,'Datos de entrada'!$B$36=Ponderaciones!$G$49),IF(Cálculo!A253<>0,Cálculo!A253,\"\"),\".\")","v":"   Bandas transportadoras"},null,{"$f":"IF(OR($C$45=1,$C$45=2,$C$45=3,'Datos de entrada'!$B$36=Ponderaciones!$G$49),IF(Cálculo!B253<>0,Cálculo!B253,\"\"),\".\")","v":277000000}]
[{"$f":"IF(OR($C$45=1,$C$45=2,$C$45=3,'Datos de entrada'!$B$36=Ponderaciones!$G$49),IF(Cálculo!A254<>0,Cálculo!A254,\"\"),\".\")","v":"   Sistema de tamizaje (piso vivo, tolva viva, bandas y tromel)"},null,{"$f":"IF(OR($C$45=1,$C$45=2,$C$45=3,'Datos de entrada'!$B$36=Ponderaciones!$G$49),IF(Cálculo!B254<>0,Cálculo!B254,\"\"),\".\")","v":185000000}]
[{"$f":"IF(OR($C$45=1,$C$45=2,$C$45=3,'Datos de entrada'!$B$36=Ponderaciones!$G$49),IF(Cálculo!A255<>0,Cálculo!A255,\"\"),\".\")","v":"   Imán de remoción de metales"},null,{"$f":"IF(OR($C$45=1,$C$45=2,$C$45=3,'Datos de entrada'!$B$36=Ponderaciones!$G$49),IF(Cálculo!B255<>0,Cálculo!B255,\"\"),\".\")","v":87883396}]
[{"$f":"IF(OR($C$45=1,$C$45=2,$C$45=3,'Datos de entrada'!$B$36=Ponderaciones!$G$49),IF(Cálculo!A256<>0,Cálculo!A256,\"\"),\".\")","v":"   Sistema separación balística "},null,{"$f":"IF(OR($C$45=1,$C$45=2,$C$45=3,'Datos de entrada'!$B$36=Ponderaciones!$G$49),IF(Cálculo!B256<>0,Cálculo!B256,\"\"),\".\")","v":461000000}]
[{"$f":"IF(OR($C$45=1,$C$45=2,$C$45=3,'Datos de entrada'!$B$36=Ponderaciones!$G$49),IF(Cálculo!A257<>0,Cálculo!A257,\"\"),\".\")","v":"   Rompebolsas"},null,{"$f":"IF(OR($C$45=1,$C$45=2,$C$45=3,'Datos de entrada'!$B$36=Ponderaciones!$G$49),IF(Cálculo!B257<>0,Cálculo!B257,\"\"),\".\")","v":554000000}]
[{"$f":"IF(OR($C$45=1,$C$45=2,$C$45=3,'Datos de entrada'!$B$36=Ponderaciones!$G$49),IF(Cálculo!A258<>0,Cálculo!A258,\"\"),\".\")","v":"   Báscula de pesaje"},null,{"$f":"IF(OR($C$45=1,$C$45=2,$C$45=3,'Datos de entrada'!$B$36=Ponderaciones!$G$49),IF(Cálculo!B258<>0,Cálculo!B258,\"\"),\".\")","v":206314606}]
[{"$f":"IF(OR($C$45=1,$C$45=2,$C$45=3,'Datos de entrada'!$B$36=Ponderaciones!$G$49),IF(Cálculo!A259<>0,Cálculo!A259,\"\"),\".\")","v":"Sistema de compostaje (Compostaje en pilas con aireación forzada)"},null,{"$f":"IF(OR($C$45=1,$C$45=2,$C$45=3,'Datos de entrada'!$B$36=Ponderaciones!$G$49),IF(Cálculo!B259<>0,Cálculo!B259,\"\"),\".\")","v":4074000000}]
[{"$f":"IF(OR($C$45=1,$C$45=2,$C$45=3,'Datos de entrada'!$B$36=Ponderaciones!$G$49),IF(Cálculo!A260<>0,Cálculo!A260,\"\"),\".\")","v":"Total Costo de Inversión Inicial"},null,{"$f":"IF(OR($C$45=1,$C$45=2,$C$45=3,'Datos de entrada'!$B$36=Ponderaciones!$G$49),IF(Cálculo!B260<>0,Cálculo!B260,\"\"),\".\")","v":6858198002}]
[{"$f":"IF(OR($C$45=1,$C$45=2,$C$45=3,'Datos de entrada'!$B$36=Ponderaciones!$G$49),IF(Cálculo!A261<>0,Cálculo!A261,\"\"),\".\")","v":""},null,{"$f":"IF(OR($C$45=1,$C$45=2,$C$45=3,'Datos de entrada'!$B$36=Ponderaciones!$G$49),IF(Cálculo!B261<>0,Cálculo!B261,\"\"),\".\")","v":""}]
[{"$f":"IF(OR($C$45=1,$C$45=2,$C$45=3,'Datos de entrada'!$B$36=Ponderaciones!$G$49),IF(Cálculo!A262<>0,Cálculo!A262,\"\"),\".\")","v":""},null,{"$f":"IF(OR($C$45=1,$C$45=2,$C$45=3,'Datos de entrada'!$B$36=Ponderaciones!$G$49),IF(Cálculo!B262<>0,Cálculo!B262,\"\"),\".\")","v":""}]
[{"$f":"IF(OR($C$45=1,$C$45=2,$C$45=3,'Datos de entrada'!$B$36=Ponderaciones!$G$49),IF(Cálculo!A263<>0,Cálculo!A263,\"\"),\".\")","v":""},null,{"$f":"IF(OR($C$45=1,$C$45=2,$C$45=3,'Datos de entrada'!$B$36=Ponderaciones!$G$49),IF(Cálculo!B263<>0,Cálculo!B263,\"\"),\".\")","v":""}]
[{"$f":"IF(OR($C$45=1,$C$45=2,$C$45=3,'Datos de entrada'!$B$36=Ponderaciones!$G$49),IF(Cálculo!A264<>0,Cálculo!A264,\"\"),\".\")","v":""},null,{"$f":"IF(OR($C$45=1,$C$45=2,$C$45=3,'Datos de entrada'!$B$36=Ponderaciones!$G$49),IF(Cálculo!B264<>0,Cálculo!B264,\"\"),\".\")","v":""}]
[]
[]
[]
[{"$f":"IF(OR($C$45=1,$C$45=2,$C$45=3,'Datos de entrada'!$B$36=Ponderaciones!$G$49),\"Costos de operación\",\".\")","v":"Costos de operación"}]
[]
[{"$f":"IF(OR($C$45=1,$C$45=2,$C$45=3,'Datos de entrada'!$B$36=Ponderaciones!$G$49),IF(Cálculo!D248<>0,Cálculo!D248,\"\"),\".\")","v":"Disposición final de rechazos diferentes a residuos que van a otro tratamiento"},null,{"$f":"IF(OR($C$45=1,$C$45=2,$C$45=3,'Datos de entrada'!$B$36=Ponderaciones!$G$49),IF(Cálculo!E248<>0,Cálculo!E248,\"\"),\".\")","v":3560000000}]
[{"$f":"IF(OR($C$45=1,$C$45=2,$C$45=3,'Datos de entrada'!$B$36=Ponderaciones!$G$49),IF(Cálculo!D249<>0,Cálculo!D249,\"\"),\".\")","v":"Tratamiento RSO (compostaje aireación forzada)"},null,{"$f":"IF(OR($C$45=1,$C$45=2,$C$45=3,'Datos de entrada'!$B$36=Ponderaciones!$G$49),IF(Cálculo!E249<>0,Cálculo!E249,\"\"),\".\")","v":868000000}]
[{"$f":"IF(OR($C$45=1,$C$45=2,$C$45=3,'Datos de entrada'!$B$36=Ponderaciones!$G$49),IF(Cálculo!D250<>0,Cálculo!D250,\"\"),\".\")","v":"Combustible"},null,{"$f":"IF(OR($C$45=1,$C$45=2,$C$45=3,'Datos de entrada'!$B$36=Ponderaciones!$G$49),IF(Cálculo!E250<>0,Cálculo!E250,\"\"),\".\")","v":108000000}]
[{"$f":"IF(OR($C$45=1,$C$45=2,$C$45=3,'Datos de entrada'!$B$36=Ponderaciones!$G$49),IF(Cálculo!D251<>0,Cálculo!D251,\"\"),\".\")","v":"Energía (consumo)"},null,{"$f":"IF(OR($C$45=1,$C$45=2,$C$45=3,'Datos de entrada'!$B$36=Ponderaciones!$G$49),IF(Cálculo!E251<>0,Cálculo!E251,\"\"),\".\")","v":299000000}]
[{"$f":"IF(OR($C$45=1,$C$45=2,$C$45=3,'Datos de entrada'!$B$36=Ponderaciones!$G$49),IF(Cálculo!D252<>0,Cálculo!D252,\"\"),\".\")","v":"Monitoreo Ambiental"},null,{"$f":"IF(OR($C$45=1,$C$45=2,$C$45=3,'Datos de entrada'!$B$36=Ponderaciones!$G$49),IF(Cálculo!E252<>0,Cálculo!E252,\"\"),\".\")","v":4000000}]
[{"$f":"IF(OR($C$45=1,$C$45=2,$C$45=3,'Datos de entrada'!$B$36=Ponderaciones!$G$49),IF(Cálculo!D253<>0,Cálculo!D253,\"\"),\".\")","v":"Mantenimiento - Maquinaria y equipos "},null,{"$f":"IF(OR($C$45=1,$C$45=2,$C$45=3,'Datos de entrada'!$B$36=Ponderaciones!$G$49),IF(Cálculo!E253<>0,Cálculo!E253,\"\"),\".\")","v":30000000}]
[{"$f":"IF(OR($C$45=1,$C$45=2,$C$45=3,'Datos de entrada'!$B$36=Ponderaciones!$G$49),IF(Cálculo!D254<>0,Cálculo!D254,\"\"),\".\")","v":"Mantenimiento - Infraestructura "},null,{"$f":"IF(OR($C$45=1,$C$45=2,$C$45=3,'Datos de entrada'!$B$36=Ponderaciones!$G$49),IF(Cálculo!E254<>0,Cálculo!E254,\"\"),\".\")","v":10000000}]
[{"$f":"IF(OR($C$45=1,$C$45=2,$C$45=3,'Datos de entrada'!$B$36=Ponderaciones!$G$49),IF(Cálculo!D255<>0,Cálculo!D255,\"\"),\".\")","v":"Mano de Obra"},null,{"$f":"IF(OR($C$45=1,$C$45=2,$C$45=3,'Datos de entrada'!$B$36=Ponderaciones!$G$49),IF(Cálculo!E255<>0,Cálculo!E255,\"\"),\".\")","v":227000000}]
[{"$f":"IF(OR($C$45=1,$C$45=2,$C$45=3,'Datos de entrada'!$B$36=Ponderaciones!$G$49),IF(Cálculo!D256<>0,Cálculo!D256,\"\"),\".\")","v":"Valor de Operación Anual"},null,{"$f":"IF(OR($C$45=1,$C$45=2,$C$45=3,'Datos de entrada'!$B$36=Ponderaciones!$G$49),IF(Cálculo!E256<>0,Cálculo!E256,\"\"),\".\")","v":4879000000}]
[{"$f":"IF(OR($C$45=1,$C$45=2,$C$45=3,'Datos de entrada'!$B$36=Ponderaciones!$G$49),IF(Cálculo!D257<>0,Cálculo!D257,\"\"),\".\")","v":""},null,{"$f":"IF(OR($C$45=1,$C$45=2,$C$45=3,'Datos de entrada'!$B$36=Ponderaciones!$G$49),IF(Cálculo!E257<>0,Cálculo!E257,\"\"),\".\")","v":""}]
[{"$f":"IF(OR($C$45=1,$C$45=2,$C$45=3,'Datos de entrada'!$B$36=Ponderaciones!$G$49),IF(Cálculo!D258<>0,Cálculo!D258,\"\"),\".\")","v":""},null,{"$f":"IF(OR($C$45=1,$C$45=2,$C$45=3,'Datos de entrada'!$B$36=Ponderaciones!$G$49),IF(Cálculo!E258<>0,Cálculo!E258,\"\"),\".\")","v":""}]
[]
[{"$f":"IF(OR($C$45=1,$C$45=2,$C$45=3,'Datos de entrada'!$B$36=Ponderaciones!$G$49),\"Ingresos\",\".\")","v":"Ingresos"}]
[]
[{"$f":"IF(OR($C$45=1,$C$45=2,$C$45=3,'Datos de entrada'!$B$36=Ponderaciones!$G$49),Cálculo!G247,\".\")","v":"Ingresos por tarifa (COP) (Promedio Anual)"},null,{"$f":"IF(OR($C$45=1,$C$45=2,$C$45=3,'Datos de entrada'!$B$36=Ponderaciones!$G$49),Cálculo!H247,\".\")","v":3296800000}]
[]
[{"$f":"IF(OR($C$45=1,$C$45=2,$C$45=3,'Datos de entrada'!$B$36=Ponderaciones!$G$49),\"Tecnología 3\",\".\")","v":"Tecnología 3"},{"$f":"IF(OR($C$45=1,$C$45=2,$C$45=3,'Datos de entrada'!$B$36=Ponderaciones!$G$49),$B$63,\".\")","v":"Compostaje en pilas con aireación forzada"}]
[]
[{"$f":"IF(OR($C$45=1,$C$45=2,$C$45=3,'Datos de entrada'!$B$36=Ponderaciones!$G$49),\"Variable\",\".\")","v":"Variable"},{"$f":"IF(OR($C$45=1,$C$45=2,$C$45=3,'Datos de entrada'!$B$36=Ponderaciones!$G$49),\"Descripción\",\".\")","v":"Descripción"}]
[{"$f":"IF(OR($C$45=1,$C$45=2,$C$45=3,'Datos de entrada'!$B$36=Ponderaciones!$G$49),'Interpretación de Resultados'!A2,\".\")","v":"Descripción"},{"$f":"IF(OR($C$45=1,$C$45=2,$C$45=3,'Datos de entrada'!$B$36=Ponderaciones!$G$49),VLOOKUP(B185,'Fichas técnicas Tecnologías'!$A$3:$K$10,2,FALSE),\".\")","v":"Proceso similar al compostaje en pilas con volteo manual, cuya diferencia radica en que el oxígeno requerido es inyectado mecánicamente. "}]
[{"$f":"IF(OR($C$45=1,$C$45=2,$C$45=3,'Datos de entrada'!$B$36=Ponderaciones!$G$49),'Interpretación de Resultados'!A3,\".\")","v":"Escala y capacidad óptima (ton/año)"},{"$f":"IF(OR($C$45=1,$C$45=2,$C$45=3,'Datos de entrada'!$B$36=Ponderaciones!$G$49),VLOOKUP(B185,'Fichas técnicas Tecnologías'!$A$3:$K$10,9,FALSE),\".\")","v":"Compost"}]
[{"$f":"IF(OR($C$45=1,$C$45=2,$C$45=3,'Datos de entrada'!$B$36=Ponderaciones!$G$49),'Interpretación de Resultados'!A4,\".\")","v":"Complejidad"},{"$f":"IF(OR($C$45=1,$C$45=2,$C$45=3,'Datos de entrada'!$B$36=Ponderaciones!$G$49),VLOOKUP(B185,'Fichas técnicas Tecnologías'!$A$3:$K$10,3,FALSE),\".\")","v":"1000 - 200000"}]
[{"$f":"IF(OR($C$45=1,$C$45=2,$C$45=3,'Datos de entrada'!$B$36=Ponderaciones!$G$49), \"Considerar\",\".\")","v":"Considerar"},{"$f":"IF(OR($C$45=1,$C$45=2,$C$45=3,'Datos de entrada'!$B$36=Ponderaciones!$G$49),VLOOKUP(B185,'Fichas técnicas Tecnologías'!$A$3:$K$10,4,FALSE),\".\")","v":"Dado que el proyecto busca dar tratamiento a aproximadamente a 45725 toneladas anuales de residuos orgánicos, cuenta con una escala adecuada para implementar la tecnología"}]
[{"$f":"IF(OR($C$45=1,$C$45=2,$C$45=3,'Datos de entrada'!$B$36=Ponderaciones!$G$49),'Interpretación de Resultados'!A5,\".\")","v":"Tipo de residuos tratados"},{"$f":"IF(OR($C$45=1,$C$45=2,$C$45=3,'Datos de entrada'!$B$36=Ponderaciones!$G$49),VLOOKUP(B185,'Fichas técnicas Tecnologías'!$A$3:$K$10,5,FALSE),\".\")","v":"Baja-media"}]
[{"$f":"IF(OR($C$45=1,$C$45=2,$C$45=3,'Datos de entrada'!$B$36=Ponderaciones!$G$49), \"Considerar\",\".\")","v":"Considerar"},{"$f":"IF(OR($C$45=1,$C$45=2,$C$45=3,'Datos de entrada'!$B$36=Ponderaciones!$G$49),VLOOKUP(B185,'Fichas técnicas Tecnologías'!$A$3:$K$10,6,FALSE),\".\")","v":"Esta tecnología no requiere personal muy tecnificado ni equipos con especificaciones técnicas elevadas.Su principal barrera se presenta por la incorrecta separación en la fuente de los residuos por parte del suscriptor.Dados las salidas obtenidas por el modelo en este aspecto se recomienda desarrollar campañas educativas que mantengan a los habitantes enterados sobre las buenas prácticas en gestión de residuos sólidos enfocados en la separación en la fuente de residuos sólidos orgánicos y en economía circular"}]
[{"$f":"IF(OR($C$45=1,$C$45=2,$C$45=3,'Datos de entrada'!$B$36=Ponderaciones!$G$49),'Interpretación de Resultados'!A6,\".\")","v":"Salidas"},{"$f":"IF(OR($C$45=1,$C$45=2,$C$45=3,'Datos de entrada'!$B$36=Ponderaciones!$G$49),VLOOKUP(B185,'Fichas técnicas Tecnologías'!$A$3:$K$10,7,FALSE),\".\")","v":"Residuos Sólidos Orgánicos (RSO)"}]
[{"$f":"IF(OR($C$45=1,$C$45=2,$C$45=3,'Datos de entrada'!$B$36=Ponderaciones!$G$49), \"Considerar\",\".\")","v":"Considerar"},{"$f":"IF(OR($C$45=1,$C$45=2,$C$45=3,'Datos de entrada'!$B$36=Ponderaciones!$G$49),VLOOKUP(B185,'Fichas técnicas Tecnologías'!$A$3:$K$10,8,FALSE),\".\")","v":"Dada que se cuenta con una separación en la fuente medianamente adecuada, es necesario fortalecerla con campañas, lo cual permitirá que los residuos destinados a tratamiento sean más homogéneos y así disminuir los costos de su adecuación para su tratamiento."}]
[{"$f":"IF(OR($C$45=1,$C$45=2,$C$45=3,'Datos de entrada'!$B$36=Ponderaciones!$G$49),'Interpretación de Resultados'!A7,\".\")","v":"Impacto ambiental"},{"$f":"IF(OR($C$45=1,$C$45=2,$C$45=3,'Datos de entrada'!$B$36=Ponderaciones!$G$49),VLOOKUP(B185,'Fichas técnicas Tecnologías'!$A$3:$K$10,11,FALSE),\".\")","v":"Olores\nRuido\nContaminación visual"}]
[{"$f":"IF(OR($C$45=1,$C$45=2,$C$45=3,'Datos de entrada'!$B$36=Ponderaciones!$G$49), \"Considerar\",\".\")","v":"Considerar"},{"$f":"IF(OR($C$45=1,$C$45=2,$C$45=3,'Datos de entrada'!$B$36=Ponderaciones!$G$49),VLOOKUP(B185,'Fichas técnicas Tecnologías'!$A$3:$N$10,12,FALSE)&VLOOKUP(B185,'Fichas técnicas Tecnologías'!$A$3:$U$10,20,FALSE),\".\")","v":"Implemente prácticas adecuadas en la operación del sistema permite evitar el impacto ambiental ocasionado. Se recomienda que revise literatura y otras experiencias sobre cómo monitorear, entre otras variables, el tamaño de las partículas, el contenido de carbono y nitrógeno, el contenido de humedad, la temperatura, el pH y la presencia de patógenos.  Algunas Corporaciones Autónomas Regionales han expedido manuales al respecto, así como entidades tales como la UAESP de Bogotá y organizaciones como ACODAL. El tamaño de la planta requiere licenciamiento ambiental, por lo tanto debe elaborar el plan de manejo ambiental y adelantar los tramites para obtenerla.Tenga presente que la tecnologia de Compostaje con aireación forzada requiere menos áreas frente a la tecnología con volteo manual. Para una planta de 46000 toneladas por año se requieren de 13 hectaréas frente a un área de 16 hectareas para la segunda. Esta tecnología presenta mayor resistencia a los cambios metereológicos, sin embargo, demanda mayor monitoreo."}]
[{"$f":"IF(OR($C$45=1,$C$45=2,$C$45=3,'Datos de entrada'!$B$36=Ponderaciones!$G$49),'Interpretación de Resultados'!A8,\".\")","v":"Desviación de residuos (ton/año)"},{"$f":"IF(OR($C$45=1,$C$45=2,$C$45=3,'Datos de entrada'!$B$36=Ponderaciones!$G$49),VLOOKUP(3,Cálculo!$B$156:$U$160,15,FALSE),\".\")","v":9218.1932601312856}]
[{"$f":"IF(OR($C$45=1,$C$45=2,$C$45=3,'Datos de entrada'!$B$36=Ponderaciones!$G$49), \"Considerar\",\".\")","v":"Considerar"},{"$f":"IF(OR($C$45=1,$C$45=2,$C$45=3,'Datos de entrada'!$B$36=Ponderaciones!$G$49),\"La desviación de residuos se estima teniendo en cuenta la capacidad de la planta.\",\".\")","v":"La desviación de residuos se estima teniendo en cuenta la capacidad de la planta."}]
[{"$f":"IF(OR($C$45=1,$C$45=2,$C$45=3,'Datos de entrada'!$B$36=Ponderaciones!$G$49),'Interpretación de Resultados'!A9,\".\")","v":"% Reducción de GEI en comparación con su disposición final en relleno sanitario"},{"$f":"IF(OR($C$45=1,$C$45=2,$C$45=3,'Datos de entrada'!$B$36=Ponderaciones!$G$49),VLOOKUP(3,Cálculo!$B$156:$U$160,19,FALSE),\".\")","v":0.4}]
[{"$f":"IF(OR($C$45=1,$C$45=2,$C$45=3,'Datos de entrada'!$B$36=Ponderaciones!$G$49), \"Considerar\",\".\")","v":"Considerar"},{"$f":"IF(OR($C$45=1,$C$45=2,$C$45=3,'Datos de entrada'!$B$36=Ponderaciones!$G$49),IF('Datos de entrada'!$B$43=Ponderaciones!$D$77, _xlfn.CONCAT(\"Se recomienda implementar un sistema de extracción y aprovechamiento del biogás en el sitio de disposición final, \", \"para tratar los Gases de Efecto Invernadero generados por la descomposición de la materia orgánica de los residuos allí dispuestos.\",VLOOKUP(B185,'Fichas técnicas Tecnologías'!A:M,13,0)), IF('Datos de entrada'!$B$43=Ponderaciones!$D$78, _xlfn.CONCAT(\"Se recomienda implementar un sistema de aprovechamiento del biogás en el sitio de disposición final, \", \"para tratar los Gases de Efecto Invernadero generados por la descomposición de la materia orgánica de los residuos allí dispuestos.\",VLOOKUP(B185,'Fichas técnicas Tecnologías'!A:M,13,0)), \"El sistema de extracción y aprovechamiento de biogás instalado en el relleno sanitario permite la reducción de Gases de Efecto Invernadero generados por la descomposición de materia orgánica de los residuos allí dispuestos.\"&VLOOKUP(B185,'Fichas técnicas Tecnologías'!A:M,13,0))),\".\")","v":"Se recomienda implementar un sistema de extracción y aprovechamiento del biogás en el sitio de disposición final, para tratar los Gases de Efecto Invernadero generados por la descomposición de la materia orgánica de los residuos allí dispuestos. Si usted desea hacer una estimación de toneladas equivalentes de CO2 puede remitirse a la herramienta de cálculo de gases de efecto invernadero (GEI) en el manejo de residuos sólidos (MRS) en este link https://www.bivica.org/file/view/id/1081 y al https://www.ifeu.de/en/project/tool-for-calculating-greenhouse-gases-ghg-in-solid-waste-management-swm/"}]
[]
[{"$f":"IF(OR($C$45=1,$C$45=2,$C$45=3,'Datos de entrada'!$B$36=Ponderaciones!$G$49),\"Costos de inversión\",\".\")","v":"Costos de inversión"}]
[]
[{"$f":"IF(OR($C$45=1,$C$45=2,$C$45=3,'Datos de entrada'!$B$36=Ponderaciones!$G$49),IF(Cálculo!A295<>0,Cálculo!A295,\"\"),\".\")","v":"Pre-inversión"},null,{"$f":"IF(OR($C$45=1,$C$45=2,$C$45=3,'Datos de entrada'!$B$36=Ponderaciones!$G$49),IF(Cálculo!B295<>0,Cálculo!B295,\"\"),\".\")","v":""}]
[{"$f":"IF(OR($C$45=1,$C$45=2,$C$45=3,'Datos de entrada'!$B$36=Ponderaciones!$G$49),IF(Cálculo!A296<>0,Cálculo!A296,\"\"),\".\")","v":"   Estudios, Diseños "},null,{"$f":"IF(OR($C$45=1,$C$45=2,$C$45=3,'Datos de entrada'!$B$36=Ponderaciones!$G$49),IF(Cálculo!B296<>0,Cálculo!B296,\"\"),\".\")","v":264000000}]
[{"$f":"IF(OR($C$45=1,$C$45=2,$C$45=3,'Datos de entrada'!$B$36=Ponderaciones!$G$49),IF(Cálculo!A297<>0,Cálculo!A297,\"\"),\".\")","v":"   Permisos"},null,{"$f":"IF(OR($C$45=1,$C$45=2,$C$45=3,'Datos de entrada'!$B$36=Ponderaciones!$G$49),IF(Cálculo!B297<>0,Cálculo!B297,\"\"),\".\")","v":72000000}]
[{"$f":"IF(OR($C$45=1,$C$45=2,$C$45=3,'Datos de entrada'!$B$36=Ponderaciones!$G$49),IF(Cálculo!A298<>0,Cálculo!A298,\"\"),\".\")","v":"Infraestructura"},null,{"$f":"IF(OR($C$45=1,$C$45=2,$C$45=3,'Datos de entrada'!$B$36=Ponderaciones!$G$49),IF(Cálculo!B298<>0,Cálculo!B298,\"\"),\".\")","v":4288000000}]
[{"$f":"IF(OR($C$45=1,$C$45=2,$C$45=3,'Datos de entrada'!$B$36=Ponderaciones!$G$49),IF(Cálculo!A299<>0,Cálculo!A299,\"\"),\".\")","v":"Maquinaria y Equipos (incluido el costo de instalación)"},null,{"$f":"IF(OR($C$45=1,$C$45=2,$C$45=3,'Datos de entrada'!$B$36=Ponderaciones!$G$49),IF(Cálculo!B299<>0,Cálculo!B299,\"\"),\".\")","v":""}]
[{"$f":"IF(OR($C$45=1,$C$45=2,$C$45=3,'Datos de entrada'!$B$36=Ponderaciones!$G$49),IF(Cálculo!A300<>0,Cálculo!A300,\"\"),\".\")","v":"   Trommel"},null,{"$f":"IF(OR($C$45=1,$C$45=2,$C$45=3,'Datos de entrada'!$B$36=Ponderaciones!$G$49),IF(Cálculo!B300<>0,Cálculo!B300,\"\"),\".\")","v":151000000}]
[{"$f":"IF(OR($C$45=1,$C$45=2,$C$45=3,'Datos de entrada'!$B$36=Ponderaciones!$G$49),IF(Cálculo!A301<>0,Cálculo!A301,\"\"),\".\")","v":"   Minicargador"},null,{"$f":"IF(OR($C$45=1,$C$45=2,$C$45=3,'Datos de entrada'!$B$36=Ponderaciones!$G$49),IF(Cálculo!B301<>0,Cálculo!B301,\"\"),\".\")","v":261448992}]
[{"$f":"IF(OR($C$45=1,$C$45=2,$C$45=3,'Datos de entrada'!$B$36=Ponderaciones!$G$49),IF(Cálculo!A302<>0,Cálculo!A302,\"\"),\".\")","v":"   Tractor"},null,{"$f":"IF(OR($C$45=1,$C$45=2,$C$45=3,'Datos de entrada'!$B$36=Ponderaciones!$G$49),IF(Cálculo!B302<>0,Cálculo!B302,\"\"),\".\")","v":261448992}]
[{"$f":"IF(OR($C$45=1,$C$45=2,$C$45=3,'Datos de entrada'!$B$36=Ponderaciones!$G$49),IF(Cálculo!A303<>0,Cálculo!A303,\"\"),\".\")","v":"   Retroexcavadora"},null,{"$f":"IF(OR($C$45=1,$C$45=2,$C$45=3,'Datos de entrada'!$B$36=Ponderaciones!$G$49),IF(Cálculo!B303<>0,Cálculo!B303,\"\"),\".\")","v":227894041}]
[{"$f":"IF(OR($C$45=1,$C$45=2,$C$45=3,'Datos de entrada'!$B$36=Ponderaciones!$G$49),IF(Cálculo!A304<>0,Cálculo!A304,\"\"),\".\")","v":"   Montacargas"},null,{"$f":"IF(OR($C$45=1,$C$45=2,$C$45=3,'Datos de entrada'!$B$36=Ponderaciones!$G$49),IF(Cálculo!B304<>0,Cálculo!B304,\"\"),\".\")","v":162182263}]
[{"$f":"IF(OR($C$45=1,$C$45=2,$C$45=3,'Datos de entrada'!$B$36=Ponderaciones!$G$49),IF(Cálculo!A305<>0,Cálculo!A305,\"\"),\".\")","v":"   Planta electrica"},null,{"$f":"IF(OR($C$45=1,$C$45=2,$C$45=3,'Datos de entrada'!$B$36=Ponderaciones!$G$49),IF(Cálculo!B305<>0,Cálculo!B305,\"\"),\".\")","v":307587050}]
[{"$f":"IF(OR($C$45=1,$C$45=2,$C$45=3,'Datos de entrada'!$B$36=Ponderaciones!$G$49),IF(Cálculo!A306<>0,Cálculo!A306,\"\"),\".\")","v":"   Compresor"},null,{"$f":"IF(OR($C$45=1,$C$45=2,$C$45=3,'Datos de entrada'!$B$36=Ponderaciones!$G$49),IF(Cálculo!B306<>0,Cálculo!B306,\"\"),\".\")","v":75498640}]
[{"$f":"IF(OR($C$45=1,$C$45=2,$C$45=3,'Datos de entrada'!$B$36=Ponderaciones!$G$49),IF(Cálculo!A307<>0,Cálculo!A307,\"\"),\".\")","v":"   Volqueta"},null,{"$f":"IF(OR($C$45=1,$C$45=2,$C$45=3,'Datos de entrada'!$B$36=Ponderaciones!$G$49),IF(Cálculo!B307<>0,Cálculo!B307,\"\"),\".\")","v":615174100}]
[{"$f":"IF(OR($C$45=1,$C$45=2,$C$45=3,'Datos de entrada'!$B$36=Ponderaciones!$G$49),IF(Cálculo!A308<>0,Cálculo!A308,\"\"),\".\")","v":"   Báscula de pesaje"},null,{"$f":"IF(OR($C$45=1,$C$45=2,$C$45=3,'Datos de entrada'!$B$36=Ponderaciones!$G$49),IF(Cálculo!B308<>0,Cálculo!B308,\"\"),\".\")","v":103157303}]
[{"$f":"IF(OR($C$45=1,$C$45=2,$C$45=3,'Datos de entrada'!$B$36=Ponderaciones!$G$49),IF(Cálculo!A309<>0,Cálculo!A309,\"\"),\".\")","v":"Total Costo de Inversión Inicial"},null,{"$f":"IF(OR($C$45=1,$C$45=2,$C$45=3,'Datos de entrada'!$B$36=Ponderaciones!$G$49),IF(Cálculo!B309<>0,Cálculo!B309,\"\"),\".\")","v":6789391381}]
[{"$f":"IF(OR($C$45=1,$C$45=2,$C$45=3,'Datos de entrada'!$B$36=Ponderaciones!$G$49),IF(Cálculo!A310<>0,Cálculo!A310,\"\"),\".\")","v":""},null,{"$f":"IF(OR($C$45=1,$C$45=2,$C$45=3,'Datos de entrada'!$B$36=Ponderaciones!$G$49),IF(Cálculo!B310<>0,Cálculo!B310,\"\"),\".\")","v":""}]
[{"$f":"IF(OR($C$45=1,$C$45=2,$C$45=3,'Datos de entrada'!$B$36=Ponderaciones!$G$49),IF(Cálculo!A311<>0,Cálculo!A311,\"\"),\".\")","v":""},null,{"$f":"IF(OR($C$45=1,$C$45=2,$C$45=3,'Datos de entrada'!$B$36=Ponderaciones!$G$49),IF(Cálculo!B311<>0,Cálculo!B311,\"\"),\".\")","v":""}]
[]
[]
[]
[{"$f":"IF(OR($C$45=1,$C$45=2,$C$45=3,'Datos de entrada'!$B$36=Ponderaciones!$G$49),\"Costos de operación\",\".\")","v":"Costos de operación"}]
[]
[{"$f":"IF(OR($C$45=1,$C$45=2,$C$45=3,'Datos de entrada'!$B$36=Ponderaciones!$G$49),IF(Cálculo!D295<>0,Cálculo!D295,\"\"),\".\")","v":"Energia"},null,{"$f":"IF(OR($C$45=1,$C$45=2,$C$45=3,'Datos de entrada'!$B$36=Ponderaciones!$G$49),IF(Cálculo!E295<>0,Cálculo!E295,\"\"),\".\")","v":67000000}]
[{"$f":"IF(OR($C$45=1,$C$45=2,$C$45=3,'Datos de entrada'!$B$36=Ponderaciones!$G$49),IF(Cálculo!D296<>0,Cálculo!D296,\"\"),\".\")","v":"Combustible"},null,{"$f":"IF(OR($C$45=1,$C$45=2,$C$45=3,'Datos de entrada'!$B$36=Ponderaciones!$G$49),IF(Cálculo!E296<>0,Cálculo!E296,\"\"),\".\")","v":259000000}]
[{"$f":"IF(OR($C$45=1,$C$45=2,$C$45=3,'Datos de entrada'!$B$36=Ponderaciones!$G$49),IF(Cálculo!D297<>0,Cálculo!D297,\"\"),\".\")","v":"Agua "},null,{"$f":"IF(OR($C$45=1,$C$45=2,$C$45=3,'Datos de entrada'!$B$36=Ponderaciones!$G$49),IF(Cálculo!E297<>0,Cálculo!E297,\"\"),\".\")","v":8000000}]
[{"$f":"IF(OR($C$45=1,$C$45=2,$C$45=3,'Datos de entrada'!$B$36=Ponderaciones!$G$49),IF(Cálculo!D298<>0,Cálculo!D298,\"\"),\".\")","v":"Tratamiento RSO"},null,{"$f":"IF(OR($C$45=1,$C$45=2,$C$45=3,'Datos de entrada'!$B$36=Ponderaciones!$G$49),IF(Cálculo!E298<>0,Cálculo!E298,\"\"),\".\")","v":868000000}]
[{"$f":"IF(OR($C$45=1,$C$45=2,$C$45=3,'Datos de entrada'!$B$36=Ponderaciones!$G$49),IF(Cálculo!D299<>0,Cálculo!D299,\"\"),\".\")","v":"Monitoreo Ambiental "},null,{"$f":"IF(OR($C$45=1,$C$45=2,$C$45=3,'Datos de entrada'!$B$36=Ponderaciones!$G$49),IF(Cálculo!E299<>0,Cálculo!E299,\"\"),\".\")","v":4000000}]
[{"$f":"IF(OR($C$45=1,$C$45=2,$C$45=3,'Datos de entrada'!$B$36=Ponderaciones!$G$49),IF(Cálculo!D300<>0,Cálculo!D300,\"\"),\".\")","v":"Mantenimiento - Maquinaria y equipos "},null,{"$f":"IF(OR($C$45=1,$C$45=2,$C$45=3,'Datos de entrada'!$B$36=Ponderaciones!$G$49),IF(Cálculo!E300<>0,Cálculo!E300,\"\"),\".\")","v":33000000}]
[{"$f":"IF(OR($C$45=1,$C$45=2,$C$45=3,'Datos de entrada'!$B$36=Ponderaciones!$G$49),IF(Cálculo!D301<>0,Cálculo!D301,\"\"),\".\")","v":"Mantenimiento - Infraestructura "},null,{"$f":"IF(OR($C$45=1,$C$45=2,$C$45=3,'Datos de entrada'!$B$36=Ponderaciones!$G$49),IF(Cálculo!E301<>0,Cálculo!E301,\"\"),\".\")","v":54000000}]
[{"$f":"IF(OR($C$45=1,$C$45=2,$C$45=3,'Datos de entrada'!$B$36=Ponderaciones!$G$49),IF(Cálculo!D302<>0,Cálculo!D302,\"\"),\".\")","v":"Mano de Obra"},null,{"$f":"IF(OR($C$45=1,$C$45=2,$C$45=3,'Datos de entrada'!$B$36=Ponderaciones!$G$49),IF(Cálculo!E302<>0,Cálculo!E302,\"\"),\".\")","v":57000000}]
[{"$f":"IF(OR($C$45=1,$C$45=2,$C$45=3,'Datos de entrada'!$B$36=Ponderaciones!$G$49),IF(Cálculo!D303<>0,Cálculo!D303,\"\"),\".\")","v":"Valor de Operación Anual"},null,{"$f":"IF(OR($C$45=1,$C$45=2,$C$45=3,'Datos de entrada'!$B$36=Ponderaciones!$G$49),IF(Cálculo!E303<>0,Cálculo!E303,\"\"),\".\")","v":1350000000}]
[{"$f":"IF(OR($C$45=1,$C$45=2,$C$45=3,'Datos de entrada'!$B$36=Ponderaciones!$G$49),IF(Cálculo!D304<>0,Cálculo!D304,\"\"),\".\")","v":""},null,{"$f":"IF(OR($C$45=1,$C$45=2,$C$45=3,'Datos de entrada'!$B$36=Ponderaciones!$G$49),IF(Cálculo!E304<>0,Cálculo!E304,\"\"),\".\")","v":""}]
[{"$f":"IF(OR($C$45=1,$C$45=2,$C$45=3,'Datos de entrada'!$B$36=Ponderaciones!$G$49),IF(Cálculo!D305<>0,Cálculo!D305,\"\"),\".\")","v":""},null,{"$f":"IF(OR($C$45=1,$C$45=2,$C$45=3,'Datos de entrada'!$B$36=Ponderaciones!$G$49),IF(Cálculo!E305<>0,Cálculo!E305,\"\"),\".\")","v":""}]
[]
[{"$f":"IF(OR($C$45=1,$C$45=2,$C$45=3,'Datos de entrada'!$B$36=Ponderaciones!$G$49),\"Ingresos\",\".\")","v":"Ingresos"}]
[]
[{"$f":"IF(OR($C$45=1,$C$45=2,$C$45=3,'Datos de entrada'!$B$36=Ponderaciones!$G$49),Cálculo!G294,\".\")","v":"Ingresos por tarifa (COP) (Promedio Anual)"},null,{"$f":"IF(OR($C$45=1,$C$45=2,$C$45=3,'Datos de entrada'!$B$36=Ponderaciones!$G$49),Cálculo!H294,\".\")","v":3296800000}]
[]
[{"$f":"IF(OR($C$45=1,$C$45=2,$C$45=3,'Datos de entrada'!$B$36=Ponderaciones!$G$49),\"MEDIDAS A IMPLEMENTAR SEGÚN EL ESCENARIO\",\"\")","v":"MEDIDAS A IMPLEMENTAR SEGÚN EL ESCENARIO"}]
[]
[]
[{"$f":"IF(OR($C$45=1,$C$45=2,$C$45=3,'Datos de entrada'!$B$36=Ponderaciones!$G$49),\"Aquí se presentan medidas generales para el escenario identificado por el modelo. Para garantizar el éxito de un proyecto de tratamiento de residuos sólidos se deben aplicar aquellas medidas con las que no se cuente en la actualidad. \",\"\")","v":"Aquí se presentan medidas generales para el escenario identificado por el modelo. Para garantizar el éxito de un proyecto de tratamiento de residuos sólidos se deben aplicar aquellas medidas con las que no se cuente en la actualidad. "}]
[]
[{"$f":"IF(OR($C$45=1,$C$45=2,$C$45=3,'Datos de entrada'!$B$36=Ponderaciones!$G$49),\"Se recomienda aplicar las siguientes medidas\",\"\")","v":"Se recomienda aplicar las siguientes medidas"}]
[]
[{"$f":"IF(OR($C$45=1,$C$45=2,$C$45=3,'Datos de entrada'!$B$36=Ponderaciones!$G$49),Cálculo!$B$146,\"\")","v":"1) Actualice el PGIRS, que prevea la viabilidad de proyectos para el tratamiento de residuos sólidos. Para ello como mínimo debe realizarse la actualización o elaboración de:\na. Caracterización de residuos con especial énfasis en la fracción orgánica\nb. Estudios técnico-operativos para determinar el tipo de tratamiento más viable\nc. Estudios de mercado que permitan determinar la viabilidad del tratamiento\n2) Fortalezca la capacidad administrativa de los municipios revisando los indicadores de gestión y resultados de la Medición de Desempeño Municipal (MDM) en los cuales existen falencias.\n3) Amplie la destinación de recursos para financiar actividades del servicio público de aseo\n4) Implemente sistemas de extracción y aprovechamiento de biogás en el sitio de disposición final\n5) Implemente un sistema de Monitoreo, Reporte y Verificación (MRV) de emisiones de la reducción de emisiones de GEI\n6) Actualice la infraestructura para la presentación de los residuos sólidos para adoptar el código de colores establecido en la Resolución 2184 de 2019.\n"}]
[]
[]
[]
[]
[]
[]
[]
[]
[]
[]
[]
[]
[]
[]
[]
[]
[]
[]
[]
[{"$f":"IF(OR($C$45=1,$C$45=2,$C$45=3,'Datos de entrada'!$B$36=Ponderaciones!$G$49),\"Es importante tener en cuenta que las medidas descritas anteriormente son de carácter general para los diferentes escenarios analizados y \"& \"sirven para fortalecer las condiciones que permiten una adecuada implementación de proyectos de tratamiento de residuos sólidos.\",\"\")","v":"Es importante tener en cuenta que las medidas descritas anteriormente son de carácter general para los diferentes escenarios analizados y sirven para fortalecer las condiciones que permiten una adecuada implementación de proyectos de tratamiento de residuos sólidos."}]
[]
[]
[]
[]
[]
[]
[]
[]
[]
[]
[]
[]
[{"$f":"+'Datos de entrada'!E13","v":"0"},"0",{"$f":"+IF(Cálculo!B128<Valoración!B3,0,1)","v":0}]
["ANÁLISIS DE TRATAMIENTO DE RESÍDUOS ORGANICOS PROVENIENTES DE LAS ACTIVIDADES DE PODA Y CORTE DE CESPED, Y DE PLAZAS DE MERCADO"]
[]
[]
[{"$f":"+IF(C283=1,\" Basado en la cantidad de residuos a tratar se considera viable llevar a cabo un proyecto de tratamiento\",\"Con base en la cantidad de residuos a tratar se considera inviable llevar a cabo un proyecto de tratamiento\")","v":"Con base en la cantidad de residuos a tratar se considera inviable llevar a cabo un proyecto de tratamiento"}]
[]
["Variable",null,"Resultado"]
["Tipo de proyecto","Compostaje de residuos organicos no contaminados","Compost Comercializable"]
["Residuos sólidos provenientes de la actividad de poda y corte, y de plazas de mercado (ton/año)","Cantidad de residuos generados en plazas de mercado, centrales de abasto o aquellos provenientes de la poda de árboles y corte de césped. Expresado en toneladas anuales.",{"$f":"IF('Datos de entrada'!B12+'Datos de entrada'!B14=0,\"Se debe indicar en los datos de entrada la cantidad de residuos provenientes de la actividad de poda y corte de cesped, y de plazas de mercado\",'Datos de entrada'!B12+'Datos de entrada'!B14)","v":"Se debe indicar en los datos de entrada la cantidad de residuos provenientes de la actividad de poda y corte de cesped, y de plazas de mercado"}]
[]
[{"$f":"IF(OR($C$45=1,$C$45=2,$C$45=3,'Datos de entrada'!$B$36=Ponderaciones!$G$49), \"Recomendaciones\",\".\")","v":"Recomendaciones"},{"$f":"IF(OR($C$45=1,$C$45=2,$C$45=3,'Datos de entrada'!$B$36=Ponderaciones!$G$49),\"Realice el estudio de mercado sobre la comercializacion del compost y su certificación ante el ICA. Evalue tratar adicionalmente residuos organicos separados en fuente siempre y cuando cuente con los controles necesarios para evitar su contaminación\",\"\")","v":"Realice el estudio de mercado sobre la comercializacion del compost y su certificación ante el ICA. Evalue tratar adicionalmente residuos organicos separados en fuente siempre y cuando cuente con los controles necesarios para evitar su contaminación"}]
[]
[]
["Opción de Tratamiento",{"$f":"+Valoración!A3","v":"Compostaje en pilas con volteo manual"}]
[]
[]
[]
[{"$f":"+'Costos de inversión'!C4","v":"Pre-inversión"},null,{"$f":"+'Costos de inversión'!P4","v":0}]
[{"$f":"+'Costos de inversión'!C5","v":"   Estudios, Diseños "},null,{"$f":"+'Costos de inversión'!P5","v":374000000}]
[{"$f":"+'Costos de inversión'!C6","v":"   Permisos"},null,{"$f":"+'Costos de inversión'!P6","v":86000000}]
[{"$f":"+'Costos de inversión'!C7","v":"Infraestructura"},null,{"$f":"+'Costos de inversión'!P7","v":17422000000}]
[{"$f":"+'Costos de inversión'!C8","v":"Maquinaria y Equipos (incluido el costo de instalación)"},null,{"$f":"+'Costos de inversión'!P8","v":0}]
[{"$f":"+'Costos de inversión'!C9","v":"   Trommel"},null,{"$f":"+'Costos de inversión'!P9","v":576000000}]
[{"$f":"+'Costos de inversión'!C10","v":"   Minicargador"},null,{"$f":"+'Costos de inversión'!P10","v":488689705}]
[{"$f":"+'Costos de inversión'!C11","v":"   Tractor"},null,{"$f":"+'Costos de inversión'!P11","v":488689705}]
[{"$f":"+'Costos de inversión'!C12","v":"   Retroexcavadora"},null,{"$f":"+'Costos de inversión'!P12","v":425970171}]
[{"$f":"+'Costos de inversión'!C13","v":"   Montacargas"},null,{"$f":"+'Costos de inversión'!P13","v":303144416}]
[{"$f":"+'Costos de inversión'!C14","v":"   Planta electrica"},null,{"$f":"+'Costos de inversión'!P14","v":287464532}]
[{"$f":"+'Costos de inversión'!C15","v":"   Compresor"},null,{"$f":"+'Costos de inversión'!P15","v":70559476}]
[{"$f":"+'Costos de inversión'!C16","v":"   Volqueta"},null,{"$f":"+'Costos de inversión'!P16","v":862393598}]
[{"$f":"+'Costos de inversión'!C17","v":"Total Costo de Inversión Inicial"},null,{"$f":"+'Costos de inversión'!P17","v":21384911603}]
[]
[{"$f":"IF(OR($C$45=1,$C$45=2,$C$45=3,'Datos de entrada'!$B$36=Ponderaciones!$G$49),\"Costos de operación\",\".\")","v":"Costos de operación"}]
[]
[{"$f":"+'Costos de operación'!C4","v":"Energia"},null,{"$f":"+'Costos de operación'!P4","v":273000000}]
[{"$f":"+'Costos de operación'!C5","v":"Combustible"},null,{"$f":"+'Costos de operación'!P5","v":1054000000}]
[{"$f":"+'Costos de operación'!C6","v":"Agua "},null,{"$f":"+'Costos de operación'!P6","v":33000000}]
[{"$f":"+'Costos de operación'!C7","v":"Tratamiento RSO"},null,{"$f":"+'Costos de operación'!P7","v":3528000000}]
[{"$f":"+'Costos de operación'!C8","v":"Monitoreo Ambiental "},null,{"$f":"+'Costos de operación'!P8","v":19000000}]
[{"$f":"+'Costos de operación'!C9","v":"Mantenimiento - Maquinaria y equipos "},null,{"$f":"+'Costos de operación'!P9","v":133000000}]
[{"$f":"+'Costos de operación'!C10","v":"Mantenimiento - Infraestructura "},null,{"$f":"+'Costos de operación'!P10","v":157000000}]
[{"$f":"+'Costos de operación'!C11","v":"Mano de Obra"},null,{"$f":"+'Costos de operación'!P11","v":247000000}]
[{"$f":"+'Costos de operación'!C12","v":"Valor de Operación Anual"},null,{"$f":"+'Costos de operación'!P12","v":5444000000}]
[]
[{"$f":"IF(OR($C$45=1,$C$45=2,$C$45=3,'Datos de entrada'!$B$36=Ponderaciones!$G$49),\"Ingresos\",\".\")","v":"Ingresos"}]
[]
[{"$f":"+Cálculo!X201","v":"Ingresos por comercialización (COP) (Promedio Anual)"},null,{"$f":"+Cálculo!L156/Cálculo!B130","v":0}]
[]
[]
["Opción de Tratamiento",{"$f":"+'Costos de operación'!A19","v":"Compostaje en pilas con aireación forzada"}]
[]
[{"$f":"IF(OR($C$45=1,$C$45=2,$C$45=3,'Datos de entrada'!$B$36=Ponderaciones!$G$49),\"Costos de inversión\",\".\")","v":"Costos de inversión"}]
[]
[{"$f":"+'Costos de inversión'!C24","v":"Pre-inversión"},null,{"$f":"+'Costos de inversión'!P24","v":0}]
[{"$f":"+'Costos de inversión'!C25","v":"   Estudios, Diseños "},null,{"$f":"+'Costos de inversión'!P25","v":1039000000}]
[{"$f":"+'Costos de inversión'!C26","v":"   Permisos"},null,{"$f":"+'Costos de inversión'!P26","v":86000000}]
[{"$f":"+'Costos de inversión'!C27","v":"Infraestructura"},null,{"$f":"+'Costos de inversión'!P27","v":18642000000}]
[{"$f":"+'Costos de inversión'!C28","v":"Maquinaria y Equipos (incluido el costo de instalación)"},null,{"$f":"+'Costos de inversión'!P28","v":0}]
[{"$f":"+'Costos de inversión'!C29","v":"   Trommel"},null,{"$f":"+'Costos de inversión'!P29","v":616000000}]
[{"$f":"+'Costos de inversión'!C30","v":"   Minicargador"},null,{"$f":"+'Costos de inversión'!P30","v":522897985}]
[{"$f":"+'Costos de inversión'!C31","v":"   Tractor"},null,{"$f":"+'Costos de inversión'!P31","v":522897985}]
[{"$f":"+'Costos de inversión'!C32","v":"   Retroexcavadora"},null,{"$f":"+'Costos de inversión'!P32","v":455788083}]
[{"$f":"+'Costos de inversión'!C33","v":"   Montacargas"},null,{"$f":"+'Costos de inversión'!P33","v":162182263}]
[{"$f":"+'Costos de inversión'!C34","v":"   Planta electrica"},null,{"$f":"+'Costos de inversión'!P34","v":615174100}]
[{"$f":"+'Costos de inversión'!C35","v":"   Compresor"},null,{"$f":"+'Costos de inversión'!P35","v":150997280}]
[{"$f":"+'Costos de inversión'!C36","v":"   Volqueta"},null,{"$f":"+'Costos de inversión'!P36","v":922761150}]
[{"$f":"+'Costos de inversión'!C37","v":"   Báscula de pesaje"},null,{"$f":"+'Costos de inversión'!P37","v":206314606}]
[{"$f":"+'Costos de inversión'!C38","v":"Total Costo de Inversión Inicial"},null,{"$f":"+'Costos de inversión'!P38","v":23942013452}]
[]
[]
[{"$f":"IF(OR($C$45=1,$C$45=2,$C$45=3,'Datos de entrada'!$B$36=Ponderaciones!$G$49),\"Costos de operación\",\".\")","v":"Costos de operación"}]
[]
[{"$f":"+'Costos de operación'!C19","v":"Energia"},null,{"$f":"+'Costos de operación'!P19","v":292000000}]
[{"$f":"+'Costos de operación'!C20","v":"Combustible"},null,{"$f":"+'Costos de operación'!P20","v":1127000000}]
[{"$f":"+'Costos de operación'!C21","v":"Agua "},null,{"$f":"+'Costos de operación'!P21","v":35000000}]
[{"$f":"+'Costos de operación'!C22","v":"Tratamiento RSO"},null,{"$f":"+'Costos de operación'!P22","v":3775000000}]
[{"$f":"+'Costos de operación'!C23","v":"Monitoreo Ambiental "},null,{"$f":"+'Costos de operación'!P23","v":19000000}]
[{"$f":"+'Costos de operación'!C24","v":"Mantenimiento - Maquinaria y equipos "},null,{"$f":"+'Costos de operación'!P24","v":143000000}]
[{"$f":"+'Costos de operación'!C25","v":"Mantenimiento - Infraestructura "},null,{"$f":"+'Costos de operación'!P25","v":235000000}]
[{"$f":"+'Costos de operación'!C26","v":"Mano de Obra"},null,{"$f":"+'Costos de operación'!P26","v":247000000}]
[{"$f":"+'Costos de operación'!C27","v":"Valor de Operación Anual"},null,{"$f":"+'Costos de operación'!P27","v":5873000000}]
[]
[{"$f":"IF(OR($C$45=1,$C$45=2,$C$45=3,'Datos de entrada'!$B$36=Ponderaciones!$G$49),\"Ingresos\",\".\")","v":"Ingresos"}]
[]
[{"$f":"+A329","v":"Ingresos por comercialización (COP) (Promedio Anual)"},null,{"$f":"+Cálculo!L157/Cálculo!B130","v":0}]

{"sheet":"Interpretación de Resultados","index":5,"n_rows":9,"n_cols":2,"rows_kept":9,"cut":false,"hidden":false,"merged":[]}
["Variable","Descripción"]
["Descripción","Breve descripción de la tecnología."]
["Escala y capacidad óptima (ton/año)","Corresponde con la cantidad típica de residuos a tratar a través del proyecto de tratamiento."]
["Complejidad","Indica el grado de dificultad de operar una tecnología. Depende del nivel de preparación técnica requerido por el personal, los requerimientos de funcionamiento y de monitoreo y laboratorio de una tecnología."]
["Tipo de residuos tratados","Indica si la tecnología es apta para residuos mixtos, orgánicos, inorgánicos, etc."]
["Salidas","Indica los subproductos de cada tecnología y si estos requieren una gestión especial posteriormente."]
["Impacto ambiental","Refiere a las afectaciones en las matrices ambientales (suelo, atmosfera, agua, biota) que pueden ocasionarse de manera directa e indirecta por el desarrollo del proyecto y que deben considerarse en el momento de evaluar su implementación."]
["Desviación de residuos (ton/año)","Corresponde a la cantidad de residuos que pueden desviarse de su disposición final en rellenos sanitarios con la implementación de la tecnología. "]
["% Reducción de GEI en comparación con su disposición final en relleno sanitario","Indica el potencial de emisiones de Gases de Efecto Invernadero (GEI) evitadas por la implementación de la tecnología en comparación con su disposición final en rellenos sanitarios."]

{"sheet":"Cálculo","index":6,"n_rows":323,"n_cols":26,"rows_kept":323,"cut":false,"hidden":true,"merged":[[153,23,153,25],[140,0,141,0],[145,0,150,0],[145,1,150,5],[121,0,121,2],[144,1,144,5]]}
["Municipios","Categoría de mercado","Población año de inicio de operaciones"]
[{"$f":"IF('Datos de entrada'!B15<>0,'Datos de entrada'!B15,\"\")","v":"HUILA - PITALITO"},{"$f":"IFERROR((VLOOKUP(A2,'Información municipios'!$E$3:$I$1124,5,FALSE)),\"\")","v":2},{"$f":"IFERROR(VLOOKUP(A2,'Información municipios'!$E$3:$F$1124,2,0)*((1+1.75%)^('Datos de entrada'!$B$5-2019)),\"\")","v":142961.23930739064},{"$f":"IFERROR(B2*1,0)","v":2}]
[{"$f":"IF('Municipios Proyecto Regional'!B2<>0,'Municipios Proyecto Regional'!B2,\"\")","v":"Huila - acevedo"},{"$f":"IFERROR((VLOOKUP(A3,'Información municipios'!$E$3:$I$1124,5,FALSE)),\"\")","v":1},{"$f":"IFERROR(VLOOKUP(A3,'Información municipios'!$E$3:$F$1124,2,0)*((1+1.75%)^('Datos de entrada'!$B$5-2019)),\"\")","v":37793.696772046875},{"$f":"IFERROR(B3*1,0)","v":1}]
[{"$f":"IF('Municipios Proyecto Regional'!B3<>0,'Municipios Proyecto Regional'!B3,\"\")","v":"huila - elías"},{"$f":"IFERROR((VLOOKUP(A4,'Información municipios'!$E$3:$I$1124,5,FALSE)),\"\")","v":1},{"$f":"IFERROR(VLOOKUP(A4,'Información municipios'!$E$3:$F$1124,2,0)*((1+1.75%)^('Datos de entrada'!$B$5-2019)),\"\")","v":4430.7018040312505},1]
[{"$f":"IF('Municipios Proyecto Regional'!B4<>0,'Municipios Proyecto Regional'!B4,\"\")","v":"Huila - Isnos"},{"$f":"IFERROR((VLOOKUP(A5,'Información municipios'!$E$3:$I$1124,5,FALSE)),\"\")","v":1},{"$f":"IFERROR(VLOOKUP(A5,'Información municipios'!$E$3:$F$1124,2,0)*((1+1.75%)^('Datos de entrada'!$B$5-2019)),\"\")","v":30054.189840468753},1]
[{"$f":"IF('Municipios Proyecto Regional'!B5<>0,'Municipios Proyecto Regional'!B5,\"\")","v":"Huila - Palestina"},{"$f":"IFERROR((VLOOKUP(A6,'Información municipios'!$E$3:$I$1124,5,FALSE)),\"\")","v":1},{"$f":"IFERROR(VLOOKUP(A6,'Información municipios'!$E$3:$F$1124,2,0)*((1+1.75%)^('Datos de entrada'!$B$5-2019)),\"\")","v":12720.096120703127},1]
[{"$f":"IF('Municipios Proyecto Regional'!B6<>0,'Municipios Proyecto Regional'!B6,\"\")","v":"Huila - Oporapa"},{"$f":"IFERROR((VLOOKUP(A7,'Información municipios'!$E$3:$I$1124,5,FALSE)),\"\")","v":1},{"$f":"IFERROR(VLOOKUP(A7,'Información municipios'!$E$3:$F$1124,2,0)*((1+1.75%)^('Datos de entrada'!$B$5-2019)),\"\")","v":15603.317908062501},1]
[{"$f":"IF('Municipios Proyecto Regional'!B7<>0,'Municipios Proyecto Regional'!B7,\"\")","v":"Huila - Saladoblanco"},{"$f":"IFERROR((VLOOKUP(A8,'Información municipios'!$E$3:$I$1124,5,FALSE)),\"\")","v":1},{"$f":"IFERROR(VLOOKUP(A8,'Información municipios'!$E$3:$F$1124,2,0)*((1+1.75%)^('Datos de entrada'!$B$5-2019)),\"\")","v":12567.349624843751},1]
[{"$f":"IF('Municipios Proyecto Regional'!B8<>0,'Municipios Proyecto Regional'!B8,\"\")","v":"Huila - San Agustín"},{"$f":"IFERROR((VLOOKUP(A9,'Información municipios'!$E$3:$I$1124,5,FALSE)),\"\")","v":1},{"$f":"IFERROR(VLOOKUP(A9,'Información municipios'!$E$3:$F$1124,2,0)*((1+1.75%)^('Datos de entrada'!$B$5-2019)),\"\")","v":35942.830611875004},1]
[{"$f":"IF('Municipios Proyecto Regional'!B9<>0,'Municipios Proyecto Regional'!B9,\"\")","v":"Huila - Timaná"},{"$f":"IFERROR((VLOOKUP(A10,'Información municipios'!$E$3:$I$1124,5,FALSE)),\"\")","v":1},{"$f":"IFERROR(VLOOKUP(A10,'Información municipios'!$E$3:$F$1124,2,0)*((1+1.75%)^('Datos de entrada'!$B$5-2019)),\"\")","v":21556.217550140627},1]
[{"$f":"IF('Municipios Proyecto Regional'!B10<>0,'Municipios Proyecto Regional'!B10,\"\")","v":""},{"$f":"IFERROR((VLOOKUP(A11,'Información municipios'!$E$3:$I$1124,5,FALSE)),\"\")","v":""},{"$f":"IFERROR(VLOOKUP(A11,'Información municipios'!$E$3:$F$1124,2,0)*((1+1.75%)^('Datos de entrada'!$B$5-2019)),\"\")","v":""},0]
[{"$f":"IF('Municipios Proyecto Regional'!B11<>0,'Municipios Proyecto Regional'!B11,\"\")","v":""},{"$f":"IFERROR((VLOOKUP(A12,'Información municipios'!$E$3:$I$1124,5,FALSE)),\"\")","v":""},{"$f":"IFERROR(VLOOKUP(A12,'Información municipios'!$E$3:$F$1124,2,0)*((1+1.75%)^('Datos de entrada'!$B$5-2019)),\"\")","v":""},0]
[{"$f":"IF('Municipios Proyecto Regional'!B12<>0,'Municipios Proyecto Regional'!B12,\"\")","v":""},{"$f":"IFERROR((VLOOKUP(A13,'Información municipios'!$E$3:$I$1124,5,FALSE)),\"\")","v":""},{"$f":"IFERROR(VLOOKUP(A13,'Información municipios'!$E$3:$F$1124,2,0)*((1+1.75%)^('Datos de entrada'!$B$5-2019)),\"\")","v":""},0]
[{"$f":"IF('Municipios Proyecto Regional'!B13<>0,'Municipios Proyecto Regional'!B13,\"\")","v":""},{"$f":"IFERROR((VLOOKUP(A14,'Información municipios'!$E$3:$I$1124,5,FALSE)),\"\")","v":""},{"$f":"IFERROR(VLOOKUP(A14,'Información municipios'!$E$3:$F$1124,2,0)*((1+1.75%)^('Datos de entrada'!$B$5-2019)),\"\")","v":""},0]
[{"$f":"IF('Municipios Proyecto Regional'!B14<>0,'Municipios Proyecto Regional'!B14,\"\")","v":""},{"$f":"IFERROR((VLOOKUP(A15,'Información municipios'!$E$3:$I$1124,5,FALSE)),\"\")","v":""},{"$f":"IFERROR(VLOOKUP(A15,'Información municipios'!$E$3:$F$1124,2,0)*((1+1.75%)^('Datos de entrada'!$B$5-2019)),\"\")","v":""},0]
[{"$f":"IF('Municipios Proyecto Regional'!B15<>0,'Municipios Proyecto Regional'!B15,\"\")","v":""},{"$f":"IFERROR((VLOOKUP(A16,'Información municipios'!$E$3:$I$1124,5,FALSE)),\"\")","v":""},{"$f":"IFERROR(VLOOKUP(A16,'Información municipios'!$E$3:$F$1124,2,0)*((1+1.75%)^('Datos de entrada'!$B$5-2019)),\"\")","v":""},0]
[{"$f":"IF('Municipios Proyecto Regional'!B16<>0,'Municipios Proyecto Regional'!B16,\"\")","v":""},{"$f":"IFERROR((VLOOKUP(A17,'Información municipios'!$E$3:$I$1124,5,FALSE)),\"\")","v":""},{"$f":"IFERROR(VLOOKUP(A17,'Información municipios'!$E$3:$F$1124,2,0)*((1+1.75%)^('Datos de entrada'!$B$5-2019)),\"\")","v":""},0]
[{"$f":"IF('Municipios Proyecto Regional'!B17<>0,'Municipios Proyecto Regional'!B17,\"\")","v":""},{"$f":"IFERROR((VLOOKUP(A18,'Información municipios'!$E$3:$I$1124,5,FALSE)),\"\")","v":""},{"$f":"IFERROR(VLOOKUP(A18,'Información municipios'!$E$3:$F$1124,2,0)*((1+1.75%)^('Datos de entrada'!$B$5-2019)),\"\")","v":""},0]
[{"$f":"IF('Municipios Proyecto Regional'!B18<>0,'Municipios Proyecto Regional'!B18,\"\")","v":""},{"$f":"IFERROR((VLOOKUP(A19,'Información municipios'!$E$3:$I$1124,5,FALSE)),\"\")","v":""},{"$f":"IFERROR(VLOOKUP(A19,'Información municipios'!$E$3:$F$1124,2,0)*((1+1.75%)^('Datos de entrada'!$B$5-2019)),\"\")","v":""},0]
[{"$f":"IF('Municipios Proyecto Regional'!B19<>0,'Municipios Proyecto Regional'!B19,\"\")","v":""},{"$f":"IFERROR((VLOOKUP(A20,'Información municipios'!$E$3:$I$1124,5,FALSE)),\"\")","v":""},{"$f":"IFERROR(VLOOKUP(A20,'Información municipios'!$E$3:$F$1124,2,0)*((1+1.75%)^('Datos de entrada'!$B$5-2019)),\"\")","v":""},0]
[{"$f":"IF('Municipios Proyecto Regional'!B20<>0,'Municipios Proyecto Regional'!B20,\"\")","v":""},{"$f":"IFERROR((VLOOKUP(A21,'Información municipios'!$E$3:$I$1124,5,FALSE)),\"\")","v":""},{"$f":"IFERROR(VLOOKUP(A21,'Información municipios'!$E$3:$F$1124,2,0)*((1+1.75%)^('Datos de entrada'!$B$5-2019)),\"\")","v":""},0]
[{"$f":"IF('Municipios Proyecto Regional'!B21<>0,'Municipios Proyecto Regional'!B21,\"\")","v":""},{"$f":"IFERROR((VLOOKUP(A22,'Información municipios'!$E$3:$I$1124,5,FALSE)),\"\")","v":""},{"$f":"IFERROR(VLOOKUP(A22,'Información municipios'!$E$3:$F$1124,2,0)*((1+1.75%)^('Datos de entrada'!$B$5-2019)),\"\")","v":""},0]
[{"$f":"IF('Municipios Proyecto Regional'!B22<>0,'Municipios Proyecto Regional'!B22,\"\")","v":""},{"$f":"IFERROR((VLOOKUP(A23,'Información municipios'!$E$3:$I$1124,5,FALSE)),\"\")","v":""},{"$f":"IFERROR(VLOOKUP(A23,'Información municipios'!$E$3:$F$1124,2,0)*((1+1.75%)^('Datos de entrada'!$B$5-2019)),\"\")","v":""},0]
[{"$f":"IF('Municipios Proyecto Regional'!B23<>0,'Municipios Proyecto Regional'!B23,\"\")","v":""},{"$f":"IFERROR((VLOOKUP(A24,'Información municipios'!$E$3:$I$1124,5,FALSE)),\"\")","v":""},{"$f":"IFERROR(VLOOKUP(A24,'Información municipios'!$E$3:$F$1124,2,0)*((1+1.75%)^('Datos de entrada'!$B$5-2019)),\"\")","v":""},0]
[{"$f":"IF('Municipios Proyecto Regional'!B24<>0,'Municipios Proyecto Regional'!B24,\"\")","v":""},{"$f":"IFERROR((VLOOKUP(A25,'Información municipios'!$E$3:$I$1124,5,FALSE)),\"\")","v":""},{"$f":"IFERROR(VLOOKUP(A25,'Información municipios'!$E$3:$F$1124,2,0)*((1+1.75%)^('Datos de entrada'!$B$5-2019)),\"\")","v":""},0]
[{"$f":"IF('Municipios Proyecto Regional'!B25<>0,'Municipios Proyecto Regional'!B25,\"\")","v":""},{"$f":"IFERROR((VLOOKUP(A26,'Información municipios'!$E$3:$I$1124,5,FALSE)),\"\")","v":""},{"$f":"IFERROR(VLOOKUP(A26,'Información municipios'!$E$3:$F$1124,2,0)*((1+1.75%)^('Datos de entrada'!$B$5-2019)),\"\")","v":""},0]
[{"$f":"IF('Municipios Proyecto Regional'!B26<>0,'Municipios Proyecto Regional'!B26,\"\")","v":""},{"$f":"IFERROR((VLOOKUP(A27,'Información municipios'!$E$3:$I$1124,5,FALSE)),\"\")","v":""},{"$f":"IFERROR(VLOOKUP(A27,'Información municipios'!$E$3:$F$1124,2,0)*((1+1.75%)^('Datos de entrada'!$B$5-2019)),\"\")","v":""},0]
[{"$f":"IF('Municipios Proyecto Regional'!B27<>0,'Municipios Proyecto Regional'!B27,\"\")","v":""},{"$f":"IFERROR((VLOOKUP(A28,'Información municipios'!$E$3:$I$1124,5,FALSE)),\"\")","v":""},{"$f":"IFERROR(VLOOKUP(A28,'Información municipios'!$E$3:$F$1124,2,0)*((1+1.75%)^('Datos de entrada'!$B$5-2019)),\"\")","v":""},0]
[{"$f":"IF('Municipios Proyecto Regional'!B28<>0,'Municipios Proyecto Regional'!B28,\"\")","v":""},{"$f":"IFERROR((VLOOKUP(A29,'Información municipios'!$E$3:$I$1124,5,FALSE)),\"\")","v":""},{"$f":"IFERROR(VLOOKUP(A29,'Información municipios'!$E$3:$F$1124,2,0)*((1+1.75%)^('Datos de entrada'!$B$5-2019)),\"\")","v":""},0]
[{"$f":"IF('Municipios Proyecto Regional'!B29<>0,'Municipios Proyecto Regional'!B29,\"\")","v":""},{"$f":"IFERROR((VLOOKUP(A30,'Información municipios'!$E$3:$I$1124,5,FALSE)),\"\")","v":""},{"$f":"IFERROR(VLOOKUP(A30,'Información municipios'!$E$3:$F$1124,2,0)*((1+1.75%)^('Datos de entrada'!$B$5-2019)),\"\")","v":""},0]
[{"$f":"IF('Municipios Proyecto Regional'!B30<>0,'Municipios Proyecto Regional'!B30,\"\")","v":""},{"$f":"IFERROR((VLOOKUP(A31,'Información municipios'!$E$3:$I$1124,5,FALSE)),\"\")","v":""},{"$f":"IFERROR(VLOOKUP(A31,'Información municipios'!$E$3:$F$1124,2,0)*((1+1.75%)^('Datos de entrada'!$B$5-2019)),\"\")","v":""},0]
[{"$f":"IF('Municipios Proyecto Regional'!B31<>0,'Municipios Proyecto Regional'!B31,\"\")","v":""},{"$f":"IFERROR((VLOOKUP(A32,'Información municipios'!$E$3:$I$1124,5,FALSE)),\"\")","v":""},{"$f":"IFERROR(VLOOKUP(A32,'Información municipios'!$E$3:$F$1124,2,0)*((1+1.75%)^('Datos de entrada'!$B$5-2019)),\"\")","v":""},0]
[{"$f":"IF('Municipios Proyecto Regional'!B32<>0,'Municipios Proyecto Regional'!B32,\"\")","v":""},{"$f":"IFERROR((VLOOKUP(A33,'Información municipios'!$E$3:$I$1124,5,FALSE)),\"\")","v":""},{"$f":"IFERROR(VLOOKUP(A33,'Información municipios'!$E$3:$F$1124,2,0)*((1+1.75%)^('Datos de entrada'!$B$5-2019)),\"\")","v":""},0]
[{"$f":"IF('Municipios Proyecto Regional'!B33<>0,'Municipios Proyecto Regional'!B33,\"\")","v":""},{"$f":"IFERROR((VLOOKUP(A34,'Información municipios'!$E$3:$I$1124,5,FALSE)),\"\")","v":""},{"$f":"IFERROR(VLOOKUP(A34,'Información municipios'!$E$3:$F$1124,2,0)*((1+1.75%)^('Datos de entrada'!$B$5-2019)),\"\")","v":""},0]
[{"$f":"IF('Municipios Proyecto Regional'!B34<>0,'Municipios Proyecto Regional'!B34,\"\")","v":""},{"$f":"IFERROR((VLOOKUP(A35,'Información municipios'!$E$3:$I$1124,5,FALSE)),\"\")","v":""},{"$f":"IFERROR(VLOOKUP(A35,'Información municipios'!$E$3:$F$1124,2,0)*((1+1.75%)^('Datos de entrada'!$B$5-2019)),\"\")","v":""},0]
[{"$f":"IF('Municipios Proyecto Regional'!B35<>0,'Municipios Proyecto Regional'!B35,\"\")","v":""},{"$f":"IFERROR((VLOOKUP(A36,'Información municipios'!$E$3:$I$1124,5,FALSE)),\"\")","v":""},{"$f":"IFERROR(VLOOKUP(A36,'Información municipios'!$E$3:$F$1124,2,0)*((1+1.75%)^('Datos de entrada'!$B$5-2019)),\"\")","v":""},0]
[{"$f":"IF('Municipios Proyecto Regional'!B36<>0,'Municipios Proyecto Regional'!B36,\"\")","v":""},{"$f":"IFERROR((VLOOKUP(A37,'Información municipios'!$E$3:$I$1124,5,FALSE)),\"\")","v":""},{"$f":"IFERROR(VLOOKUP(A37,'Información municipios'!$E$3:$F$1124,2,0)*((1+1.75%)^('Datos de entrada'!$B$5-2019)),\"\")","v":""},0]
[{"$f":"IF('Municipios Proyecto Regional'!B37<>0,'Municipios Proyecto Regional'!B37,\"\")","v":""},{"$f":"IFERROR((VLOOKUP(A38,'Información municipios'!$E$3:$I$1124,5,FALSE)),\"\")","v":""},{"$f":"IFERROR(VLOOKUP(A38,'Información municipios'!$E$3:$F$1124,2,0)*((1+1.75%)^('Datos de entrada'!$B$5-2019)),\"\")","v":""},0]
[{"$f":"IF('Municipios Proyecto Regional'!B38<>0,'Municipios Proyecto Regional'!B38,\"\")","v":""},{"$f":"IFERROR((VLOOKUP(A39,'Información municipios'!$E$3:$I$1124,5,FALSE)),\"\")","v":""},{"$f":"IFERROR(VLOOKUP(A39,'Información municipios'!$E$3:$F$1124,2,0)*((1+1.75%)^('Datos de entrada'!$B$5-2019)),\"\")","v":""},0]
[{"$f":"IF('Municipios Proyecto Regional'!B39<>0,'Municipios Proyecto Regional'!B39,\"\")","v":""},{"$f":"IFERROR((VLOOKUP(A40,'Información municipios'!$E$3:$I$1124,5,FALSE)),\"\")","v":""},{"$f":"IFERROR(VLOOKUP(A40,'Información municipios'!$E$3:$F$1124,2,0)*((1+1.75%)^('Datos de entrada'!$B$5-2019)),\"\")","v":""},0]
[{"$f":"IF('Municipios Proyecto Regional'!B40<>0,'Municipios Proyecto Regional'!B40,\"\")","v":""},{"$f":"IFERROR((VLOOKUP(A41,'Información municipios'!$E$3:$I$1124,5,FALSE)),\"\")","v":""},{"$f":"IFERROR(VLOOKUP(A41,'Información municipios'!$E$3:$F$1124,2,0)*((1+1.75%)^('Datos de entrada'!$B$5-2019)),\"\")","v":""},0]
[{"$f":"IF('Municipios Proyecto Regional'!B41<>0,'Municipios Proyecto Regional'!B41,\"\")","v":""},{"$f":"IFERROR((VLOOKUP(A42,'Información municipios'!$E$3:$I$1124,5,FALSE)),\"\")","v":""},{"$f":"IFERROR(VLOOKUP(A42,'Información municipios'!$E$3:$F$1124,2,0)*((1+1.75%)^('Datos de entrada'!$B$5-2019)),\"\")","v":""},0]
[{"$f":"IF('Municipios Proyecto Regional'!B42<>0,'Municipios Proyecto Regional'!B42,\"\")","v":""},{"$f":"IFERROR((VLOOKUP(A43,'Información municipios'!$E$3:$I$1124,5,FALSE)),\"\")","v":""},{"$f":"IFERROR(VLOOKUP(A43,'Información municipios'!$E$3:$F$1124,2,0)*((1+1.75%)^('Datos de entrada'!$B$5-2019)),\"\")","v":""},0]
[{"$f":"IF('Municipios Proyecto Regional'!B43<>0,'Municipios Proyecto Regional'!B43,\"\")","v":""},{"$f":"IFERROR((VLOOKUP(A44,'Información municipios'!$E$3:$I$1124,5,FALSE)),\"\")","v":""},{"$f":"IFERROR(VLOOKUP(A44,'Información municipios'!$E$3:$F$1124,2,0)*((1+1.75%)^('Datos de entrada'!$B$5-2019)),\"\")","v":""},0]
[{"$f":"IF('Municipios Proyecto Regional'!B44<>0,'Municipios Proyecto Regional'!B44,\"\")","v":""},{"$f":"IFERROR((VLOOKUP(A45,'Información municipios'!$E$3:$I$1124,5,FALSE)),\"\")","v":""},{"$f":"IFERROR(VLOOKUP(A45,'Información municipios'!$E$3:$F$1124,2,0)*((1+1.75%)^('Datos de entrada'!$B$5-2019)),\"\")","v":""},0]
[{"$f":"IF('Municipios Proyecto Regional'!B45<>0,'Municipios Proyecto Regional'!B45,\"\")","v":""},{"$f":"IFERROR((VLOOKUP(A46,'Información municipios'!$E$3:$I$1124,5,FALSE)),\"\")","v":""},{"$f":"IFERROR(VLOOKUP(A46,'Información municipios'!$E$3:$F$1124,2,0)*((1+1.75%)^('Datos de entrada'!$B$5-2019)),\"\")","v":""},0]
[{"$f":"IF('Municipios Proyecto Regional'!B46<>0,'Municipios Proyecto Regional'!B46,\"\")","v":""},{"$f":"IFERROR((VLOOKUP(A47,'Información municipios'!$E$3:$I$1124,5,FALSE)),\"\")","v":""},{"$f":"IFERROR(VLOOKUP(A47,'Información municipios'!$E$3:$F$1124,2,0)*((1+1.75%)^('Datos de entrada'!$B$5-2019)),\"\")","v":""},0]
[{"$f":"IF('Municipios Proyecto Regional'!B47<>0,'Municipios Proyecto Regional'!B47,\"\")","v":""},{"$f":"IFERROR((VLOOKUP(A48,'Información municipios'!$E$3:$I$1124,5,FALSE)),\"\")","v":""},{"$f":"IFERROR(VLOOKUP(A48,'Información municipios'!$E$3:$F$1124,2,0)*((1+1.75%)^('Datos de entrada'!$B$5-2019)),\"\")","v":""},0]
[{"$f":"IF('Municipios Proyecto Regional'!B48<>0,'Municipios Proyecto Regional'!B48,\"\")","v":""},{"$f":"IFERROR((VLOOKUP(A49,'Información municipios'!$E$3:$I$1124,5,FALSE)),\"\")","v":""},{"$f":"IFERROR(VLOOKUP(A49,'Información municipios'!$E$3:$F$1124,2,0)*((1+1.75%)^('Datos de entrada'!$B$5-2019)),\"\")","v":""},0]
[{"$f":"IF('Municipios Proyecto Regional'!B49<>0,'Municipios Proyecto Regional'!B49,\"\")","v":""},{"$f":"IFERROR((VLOOKUP(A50,'Información municipios'!$E$3:$I$1124,5,FALSE)),\"\")","v":""},{"$f":"IFERROR(VLOOKUP(A50,'Información municipios'!$E$3:$F$1124,2,0)*((1+1.75%)^('Datos de entrada'!$B$5-2019)),\"\")","v":""},0]
[{"$f":"IF('Municipios Proyecto Regional'!B50<>0,'Municipios Proyecto Regional'!B50,\"\")","v":""},{"$f":"IFERROR((VLOOKUP(A51,'Información municipios'!$E$3:$I$1124,5,FALSE)),\"\")","v":""},{"$f":"IFERROR(VLOOKUP(A51,'Información municipios'!$E$3:$F$1124,2,0)*((1+1.75%)^('Datos de entrada'!$B$5-2019)),\"\")","v":""},0]
[{"$f":"IF('Municipios Proyecto Regional'!B51<>0,'Municipios Proyecto Regional'!B51,\"\")","v":""},{"$f":"IFERROR((VLOOKUP(A52,'Información municipios'!$E$3:$I$1124,5,FALSE)),\"\")","v":""},{"$f":"IFERROR(VLOOKUP(A52,'Información municipios'!$E$3:$F$1124,2,0)*((1+1.75%)^('Datos de entrada'!$B$5-2019)),\"\")","v":""},0]
[{"$f":"IF('Municipios Proyecto Regional'!B52<>0,'Municipios Proyecto Regional'!B52,\"\")","v":""},{"$f":"IFERROR((VLOOKUP(A53,'Información municipios'!$E$3:$I$1124,5,FALSE)),\"\")","v":""},{"$f":"IFERROR(VLOOKUP(A53,'Información municipios'!$E$3:$F$1124,2,0)*((1+1.75%)^('Datos de entrada'!$B$5-2019)),\"\")","v":""},0]
[{"$f":"IF('Municipios Proyecto Regional'!B53<>0,'Municipios Proyecto Regional'!B53,\"\")","v":""},{"$f":"IFERROR((VLOOKUP(A54,'Información municipios'!$E$3:$I$1124,5,FALSE)),\"\")","v":""},{"$f":"IFERROR(VLOOKUP(A54,'Información municipios'!$E$3:$F$1124,2,0)*((1+1.75%)^('Datos de entrada'!$B$5-2019)),\"\")","v":""},0]
[{"$f":"IF('Municipios Proyecto Regional'!B54<>0,'Municipios Proyecto Regional'!B54,\"\")","v":""},{"$f":"IFERROR((VLOOKUP(A55,'Información municipios'!$E$3:$I$1124,5,FALSE)),\"\")","v":""},{"$f":"IFERROR(VLOOKUP(A55,'Información municipios'!$E$3:$F$1124,2,0)*((1+1.75%)^('Datos de entrada'!$B$5-2019)),\"\")","v":""},0]
[{"$f":"IF('Municipios Proyecto Regional'!B55<>0,'Municipios Proyecto Regional'!B55,\"\")","v":""},{"$f":"IFERROR((VLOOKUP(A56,'Información municipios'!$E$3:$I$1124,5,FALSE)),\"\")","v":""},{"$f":"IFERROR(VLOOKUP(A56,'Información municipios'!$E$3:$F$1124,2,0)*((1+1.75%)^('Datos de entrada'!$B$5-2019)),\"\")","v":""},0]
[{"$f":"IF('Municipios Proyecto Regional'!B56<>0,'Municipios Proyecto Regional'!B56,\"\")","v":""},{"$f":"IFERROR((VLOOKUP(A57,'Información municipios'!$E$3:$I$1124,5,FALSE)),\"\")","v":""},{"$f":"IFERROR(VLOOKUP(A57,'Información municipios'!$E$3:$F$1124,2,0)*((1+1.75%)^('Datos de entrada'!$B$5-2019)),\"\")","v":""},0]
[{"$f":"IF('Municipios Proyecto Regional'!B57<>0,'Municipios Proyecto Regional'!B57,\"\")","v":""},{"$f":"IFERROR((VLOOKUP(A58,'Información municipios'!$E$3:$I$1124,5,FALSE)),\"\")","v":""},{"$f":"IFERROR(VLOOKUP(A58,'Información municipios'!$E$3:$F$1124,2,0)*((1+1.75%)^('Datos de entrada'!$B$5-2019)),\"\")","v":""},0]
[{"$f":"IF('Municipios Proyecto Regional'!B58<>0,'Municipios Proyecto Regional'!B58,\"\")","v":""},{"$f":"IFERROR((VLOOKUP(A59,'Información municipios'!$E$3:$I$1124,5,FALSE)),\"\")","v":""},{"$f":"IFERROR(VLOOKUP(A59,'Información municipios'!$E$3:$F$1124,2,0)*((1+1.75%)^('Datos de entrada'!$B$5-2019)),\"\")","v":""},0]
[{"$f":"IF('Municipios Proyecto Regional'!B59<>0,'Municipios Proyecto Regional'!B59,\"\")","v":""},{"$f":"IFERROR((VLOOKUP(A60,'Información municipios'!$E$3:$I$1124,5,FALSE)),\"\")","v":""},{"$f":"IFERROR(VLOOKUP(A60,'Información municipios'!$E$3:$F$1124,2,0)*((1+1.75%)^('Datos de entrada'!$B$5-2019)),\"\")","v":""},0]
[{"$f":"IF('Municipios Proyecto Regional'!B60<>0,'Municipios Proyecto Regional'!B60,\"\")","v":""},{"$f":"IFERROR((VLOOKUP(A61,'Información municipios'!$E$3:$I$1124,5,FALSE)),\"\")","v":""},{"$f":"IFERROR(VLOOKUP(A61,'Información municipios'!$E$3:$F$1124,2,0)*((1+1.75%)^('Datos de entrada'!$B$5-2019)),\"\")","v":""},0]
[{"$f":"IF('Municipios Proyecto Regional'!B61<>0,'Municipios Proyecto Regional'!B61,\"\")","v":""},{"$f":"IFERROR((VLOOKUP(A62,'Información municipios'!$E$3:$I$1124,5,FALSE)),\"\")","v":""},{"$f":"IFERROR(VLOOKUP(A62,'Información municipios'!$E$3:$F$1124,2,0)*((1+1.75%)^('Datos de entrada'!$B$5-2019)),\"\")","v":""},0]
[{"$f":"IF('Municipios Proyecto Regional'!B62<>0,'Municipios Proyecto Regional'!B62,\"\")","v":""},{"$f":"IFERROR((VLOOKUP(A63,'Información municipios'!$E$3:$I$1124,5,FALSE)),\"\")","v":""},{"$f":"IFERROR(VLOOKUP(A63,'Información municipios'!$E$3:$F$1124,2,0)*((1+1.75%)^('Datos de entrada'!$B$5-2019)),\"\")","v":""},0]
[{"$f":"IF('Municipios Proyecto Regional'!B63<>0,'Municipios Proyecto Regional'!B63,\"\")","v":""},{"$f":"IFERROR((VLOOKUP(A64,'Información municipios'!$E$3:$I$1124,5,FALSE)),\"\")","v":""},{"$f":"IFERROR(VLOOKUP(A64,'Información municipios'!$E$3:$F$1124,2,0)*((1+1.75%)^('Datos de entrada'!$B$5-2019)),\"\")","v":""},0]
[{"$f":"IF('Municipios Proyecto Regional'!B64<>0,'Municipios Proyecto Regional'!B64,\"\")","v":""},{"$f":"IFERROR((VLOOKUP(A65,'Información municipios'!$E$3:$I$1124,5,FALSE)),\"\")","v":""},{"$f":"IFERROR(VLOOKUP(A65,'Información municipios'!$E$3:$F$1124,2,0)*((1+1.75%)^('Datos de entrada'!$B$5-2019)),\"\")","v":""},0]
[{"$f":"IF('Municipios Proyecto Regional'!B65<>0,'Municipios Proyecto Regional'!B65,\"\")","v":""},{"$f":"IFERROR((VLOOKUP(A66,'Información municipios'!$E$3:$I$1124,5,FALSE)),\"\")","v":""},{"$f":"IFERROR(VLOOKUP(A66,'Información municipios'!$E$3:$F$1124,2,0)*((1+1.75%)^('Datos de entrada'!$B$5-2019)),\"\")","v":""},0]
[{"$f":"IF('Municipios Proyecto Regional'!B66<>0,'Municipios Proyecto Regional'!B66,\"\")","v":""},{"$f":"IFERROR((VLOOKUP(A67,'Información municipios'!$E$3:$I$1124,5,FALSE)),\"\")","v":""},{"$f":"IFERROR(VLOOKUP(A67,'Información municipios'!$E$3:$F$1124,2,0)*((1+1.75%)^('Datos de entrada'!$B$5-2019)),\"\")","v":""},{"$f":"IFERROR(B67*1,0)","v":0}]
[{"$f":"IF('Municipios Proyecto Regional'!B67<>0,'Municipios Proyecto Regional'!B67,\"\")","v":""},{"$f":"IFERROR((VLOOKUP(A68,'Información municipios'!$E$3:$I$1124,5,FALSE)),\"\")","v":""},{"$f":"IFERROR(VLOOKUP(A68,'Información municipios'!$E$3:$F$1124,2,0)*((1+1.75%)^('Datos de entrada'!$B$5-2019)),\"\")","v":""},0]
[{"$f":"IF('Municipios Proyecto Regional'!B68<>0,'Municipios Proyecto Regional'!B68,\"\")","v":""},{"$f":"IFERROR((VLOOKUP(A69,'Información municipios'!$E$3:$I$1124,5,FALSE)),\"\")","v":""},{"$f":"IFERROR(VLOOKUP(A69,'Información municipios'!$E$3:$F$1124,2,0)*((1+1.75%)^('Datos de entrada'!$B$5-2019)),\"\")","v":""},0]
[{"$f":"IF('Municipios Proyecto Regional'!B69<>0,'Municipios Proyecto Regional'!B69,\"\")","v":""},{"$f":"IFERROR((VLOOKUP(A70,'Información municipios'!$E$3:$I$1124,5,FALSE)),\"\")","v":""},{"$f":"IFERROR(VLOOKUP(A70,'Información municipios'!$E$3:$F$1124,2,0)*((1+1.75%)^('Datos de entrada'!$B$5-2019)),\"\")","v":""},0]
[{"$f":"IF('Municipios Proyecto Regional'!B70<>0,'Municipios Proyecto Regional'!B70,\"\")","v":""},{"$f":"IFERROR((VLOOKUP(A71,'Información municipios'!$E$3:$I$1124,5,FALSE)),\"\")","v":""},{"$f":"IFERROR(VLOOKUP(A71,'Información municipios'!$E$3:$F$1124,2,0)*((1+1.75%)^('Datos de entrada'!$B$5-2019)),\"\")","v":""},0]
[{"$f":"IF('Municipios Proyecto Regional'!B71<>0,'Municipios Proyecto Regional'!B71,\"\")","v":""},{"$f":"IFERROR((VLOOKUP(A72,'Información municipios'!$E$3:$I$1124,5,FALSE)),\"\")","v":""},{"$f":"IFERROR(VLOOKUP(A72,'Información municipios'!$E$3:$F$1124,2,0)*((1+1.75%)^('Datos de entrada'!$B$5-2019)),\"\")","v":""},0]
[{"$f":"IF('Municipios Proyecto Regional'!B72<>0,'Municipios Proyecto Regional'!B72,\"\")","v":""},{"$f":"IFERROR((VLOOKUP(A73,'Información municipios'!$E$3:$I$1124,5,FALSE)),\"\")","v":""},{"$f":"IFERROR(VLOOKUP(A73,'Información municipios'!$E$3:$F$1124,2,0)*((1+1.75%)^('Datos de entrada'!$B$5-2019)),\"\")","v":""},0]
[{"$f":"IF('Municipios Proyecto Regional'!B73<>0,'Municipios Proyecto Regional'!B73,\"\")","v":""},{"$f":"IFERROR((VLOOKUP(A74,'Información municipios'!$E$3:$I$1124,5,FALSE)),\"\")","v":""},{"$f":"IFERROR(VLOOKUP(A74,'Información municipios'!$E$3:$F$1124,2,0)*((1+1.75%)^('Datos de entrada'!$B$5-2019)),\"\")","v":""},0]
[{"$f":"IF('Municipios Proyecto Regional'!B74<>0,'Municipios Proyecto Regional'!B74,\"\")","v":""},{"$f":"IFERROR((VLOOKUP(A75,'Información municipios'!$E$3:$I$1124,5,FALSE)),\"\")","v":""},{"$f":"IFERROR(VLOOKUP(A75,'Información municipios'!$E$3:$F$1124,2,0)*((1+1.75%)^('Datos de entrada'!$B$5-2019)),\"\")","v":""},0]
[{"$f":"IF('Municipios Proyecto Regional'!B75<>0,'Municipios Proyecto Regional'!B75,\"\")","v":""},{"$f":"IFERROR((VLOOKUP(A76,'Información municipios'!$E$3:$I$1124,5,FALSE)),\"\")","v":""},{"$f":"IFERROR(VLOOKUP(A76,'Información municipios'!$E$3:$F$1124,2,0)*((1+1.75%)^('Datos de entrada'!$B$5-2019)),\"\")","v":""},0]
[{"$f":"IF('Municipios Proyecto Regional'!B76<>0,'Municipios Proyecto Regional'!B76,\"\")","v":""},{"$f":"IFERROR((VLOOKUP(A77,'Información municipios'!$E$3:$I$1124,5,FALSE)),\"\")","v":""},{"$f":"IFERROR(VLOOKUP(A77,'Información municipios'!$E$3:$F$1124,2,0)*((1+1.75%)^('Datos de entrada'!$B$5-2019)),\"\")","v":""},0]
[{"$f":"IF('Municipios Proyecto Regional'!B77<>0,'Municipios Proyecto Regional'!B77,\"\")","v":""},{"$f":"IFERROR((VLOOKUP(A78,'Información municipios'!$E$3:$I$1124,5,FALSE)),\"\")","v":""},{"$f":"IFERROR(VLOOKUP(A78,'Información municipios'!$E$3:$F$1124,2,0)*((1+1.75%)^('Datos de entrada'!$B$5-2019)),\"\")","v":""},0]
[{"$f":"IF('Municipios Proyecto Regional'!B78<>0,'Municipios Proyecto Regional'!B78,\"\")","v":""},{"$f":"IFERROR((VLOOKUP(A79,'Información municipios'!$E$3:$I$1124,5,FALSE)),\"\")","v":""},{"$f":"IFERROR(VLOOKUP(A79,'Información municipios'!$E$3:$F$1124,2,0)*((1+1.75%)^('Datos de entrada'!$B$5-2019)),\"\")","v":""},0]
[{"$f":"IF('Municipios Proyecto Regional'!B79<>0,'Municipios Proyecto Regional'!B79,\"\")","v":""},{"$f":"IFERROR((VLOOKUP(A80,'Información municipios'!$E$3:$I$1124,5,FALSE)),\"\")","v":""},{"$f":"IFERROR(VLOOKUP(A80,'Información municipios'!$E$3:$F$1124,2,0)*((1+1.75%)^('Datos de entrada'!$B$5-2019)),\"\")","v":""},0]
[{"$f":"IF('Municipios Proyecto Regional'!B80<>0,'Municipios Proyecto Regional'!B80,\"\")","v":""},{"$f":"IFERROR((VLOOKUP(A81,'Información municipios'!$E$3:$I$1124,5,FALSE)),\"\")","v":""},{"$f":"IFERROR(VLOOKUP(A81,'Información municipios'!$E$3:$F$1124,2,0)*((1+1.75%)^('Datos de entrada'!$B$5-2019)),\"\")","v":""},0]
[{"$f":"IF('Municipios Proyecto Regional'!B81<>0,'Municipios Proyecto Regional'!B81,\"\")","v":""},{"$f":"IFERROR((VLOOKUP(A82,'Información municipios'!$E$3:$I$1124,5,FALSE)),\"\")","v":""},{"$f":"IFERROR(VLOOKUP(A82,'Información municipios'!$E$3:$F$1124,2,0)*((1+1.75%)^('Datos de entrada'!$B$5-2019)),\"\")","v":""},0]
[{"$f":"IF('Municipios Proyecto Regional'!B82<>0,'Municipios Proyecto Regional'!B82,\"\")","v":""},{"$f":"IFERROR((VLOOKUP(A83,'Información municipios'!$E$3:$I$1124,5,FALSE)),\"\")","v":""},{"$f":"IFERROR(VLOOKUP(A83,'Información municipios'!$E$3:$F$1124,2,0)*((1+1.75%)^('Datos de entrada'!$B$5-2019)),\"\")","v":""},0]
[{"$f":"IF('Municipios Proyecto Regional'!B83<>0,'Municipios Proyecto Regional'!B83,\"\")","v":""},{"$f":"IFERROR((VLOOKUP(A84,'Información municipios'!$E$3:$I$1124,5,FALSE)),\"\")","v":""},{"$f":"IFERROR(VLOOKUP(A84,'Información municipios'!$E$3:$F$1124,2,0)*((1+1.75%)^('Datos de entrada'!$B$5-2019)),\"\")","v":""},0]
[{"$f":"IF('Municipios Proyecto Regional'!B84<>0,'Municipios Proyecto Regional'!B84,\"\")","v":""},{"$f":"IFERROR((VLOOKUP(A85,'Información municipios'!$E$3:$I$1124,5,FALSE)),\"\")","v":""},{"$f":"IFERROR(VLOOKUP(A85,'Información municipios'!$E$3:$F$1124,2,0)*((1+1.75%)^('Datos de entrada'!$B$5-2019)),\"\")","v":""},0]
[{"$f":"IF('Municipios Proyecto Regional'!B85<>0,'Municipios Proyecto Regional'!B85,\"\")","v":""},{"$f":"IFERROR((VLOOKUP(A86,'Información municipios'!$E$3:$I$1124,5,FALSE)),\"\")","v":""},{"$f":"IFERROR(VLOOKUP(A86,'Información municipios'!$E$3:$F$1124,2,0)*((1+1.75%)^('Datos de entrada'!$B$5-2019)),\"\")","v":""},0]
[{"$f":"IF('Municipios Proyecto Regional'!B86<>0,'Municipios Proyecto Regional'!B86,\"\")","v":""},{"$f":"IFERROR((VLOOKUP(A87,'Información municipios'!$E$3:$I$1124,5,FALSE)),\"\")","v":""},{"$f":"IFERROR(VLOOKUP(A87,'Información municipios'!$E$3:$F$1124,2,0)*((1+1.75%)^('Datos de entrada'!$B$5-2019)),\"\")","v":""},0]
[{"$f":"IF('Municipios Proyecto Regional'!B87<>0,'Municipios Proyecto Regional'!B87,\"\")","v":""},{"$f":"IFERROR((VLOOKUP(A88,'Información municipios'!$E$3:$I$1124,5,FALSE)),\"\")","v":""},{"$f":"IFERROR(VLOOKUP(A88,'Información municipios'!$E$3:$F$1124,2,0)*((1+1.75%)^('Datos de entrada'!$B$5-2019)),\"\")","v":""},0]
[{"$f":"IF('Municipios Proyecto Regional'!B88<>0,'Municipios Proyecto Regional'!B88,\"\")","v":""},{"$f":"IFERROR((VLOOKUP(A89,'Información municipios'!$E$3:$I$1124,5,FALSE)),\"\")","v":""},{"$f":"IFERROR(VLOOKUP(A89,'Información municipios'!$E$3:$F$1124,2,0)*((1+1.75%)^('Datos de entrada'!$B$5-2019)),\"\")","v":""},0]
[{"$f":"IF('Municipios Proyecto Regional'!B89<>0,'Municipios Proyecto Regional'!B89,\"\")","v":""},{"$f":"IFERROR((VLOOKUP(A90,'Información municipios'!$E$3:$I$1124,5,FALSE)),\"\")","v":""},{"$f":"IFERROR(VLOOKUP(A90,'Información municipios'!$E$3:$F$1124,2,0)*((1+1.75%)^('Datos de entrada'!$B$5-2019)),\"\")","v":""},0]
[{"$f":"IF('Municipios Proyecto Regional'!B90<>0,'Municipios Proyecto Regional'!B90,\"\")","v":""},{"$f":"IFERROR((VLOOKUP(A91,'Información municipios'!$E$3:$I$1124,5,FALSE)),\"\")","v":""},{"$f":"IFERROR(VLOOKUP(A91,'Información municipios'!$E$3:$F$1124,2,0)*((1+1.75%)^('Datos de entrada'!$B$5-2019)),\"\")","v":""},0]
[{"$f":"IF('Municipios Proyecto Regional'!B91<>0,'Municipios Proyecto Regional'!B91,\"\")","v":""},{"$f":"IFERROR((VLOOKUP(A92,'Información municipios'!$E$3:$I$1124,5,FALSE)),\"\")","v":""},{"$f":"IFERROR(VLOOKUP(A92,'Información municipios'!$E$3:$F$1124,2,0)*((1+1.75%)^('Datos de entrada'!$B$5-2019)),\"\")","v":""},0]
[{"$f":"IF('Municipios Proyecto Regional'!B92<>0,'Municipios Proyecto Regional'!B92,\"\")","v":""},{"$f":"IFERROR((VLOOKUP(A93,'Información municipios'!$E$3:$I$1124,5,FALSE)),\"\")","v":""},{"$f":"IFERROR(VLOOKUP(A93,'Información municipios'!$E$3:$F$1124,2,0)*((1+1.75%)^('Datos de entrada'!$B$5-2019)),\"\")","v":""},0]
[{"$f":"IF('Municipios Proyecto Regional'!B93<>0,'Municipios Proyecto Regional'!B93,\"\")","v":""},{"$f":"IFERROR((VLOOKUP(A94,'Información municipios'!$E$3:$I$1124,5,FALSE)),\"\")","v":""},{"$f":"IFERROR(VLOOKUP(A94,'Información municipios'!$E$3:$F$1124,2,0)*((1+1.75%)^('Datos de entrada'!$B$5-2019)),\"\")","v":""},0]
[{"$f":"IF('Municipios Proyecto Regional'!B94<>0,'Municipios Proyecto Regional'!B94,\"\")","v":""},{"$f":"IFERROR((VLOOKUP(A95,'Información municipios'!$E$3:$I$1124,5,FALSE)),\"\")","v":""},{"$f":"IFERROR(VLOOKUP(A95,'Información municipios'!$E$3:$F$1124,2,0)*((1+1.75%)^('Datos de entrada'!$B$5-2019)),\"\")","v":""},0]
[{"$f":"IF('Municipios Proyecto Regional'!B95<>0,'Municipios Proyecto Regional'!B95,\"\")","v":""},{"$f":"IFERROR((VLOOKUP(A96,'Información municipios'!$E$3:$I$1124,5,FALSE)),\"\")","v":""},{"$f":"IFERROR(VLOOKUP(A96,'Información municipios'!$E$3:$F$1124,2,0)*((1+1.75%)^('Datos de entrada'!$B$5-2019)),\"\")","v":""},0]
[{"$f":"IF('Municipios Proyecto Regional'!B96<>0,'Municipios Proyecto Regional'!B96,\"\")","v":""},{"$f":"IFERROR((VLOOKUP(A97,'Información municipios'!$E$3:$I$1124,5,FALSE)),\"\")","v":""},{"$f":"IFERROR(VLOOKUP(A97,'Información municipios'!$E$3:$F$1124,2,0)*((1+1.75%)^('Datos de entrada'!$B$5-2019)),\"\")","v":""},0]
[{"$f":"IF('Municipios Proyecto Regional'!B97<>0,'Municipios Proyecto Regional'!B97,\"\")","v":""},{"$f":"IFERROR((VLOOKUP(A98,'Información municipios'!$E$3:$I$1124,5,FALSE)),\"\")","v":""},{"$f":"IFERROR(VLOOKUP(A98,'Información municipios'!$E$3:$F$1124,2,0)*((1+1.75%)^('Datos de entrada'!$B$5-2019)),\"\")","v":""},0]
[{"$f":"IF('Municipios Proyecto Regional'!B98<>0,'Municipios Proyecto Regional'!B98,\"\")","v":""},{"$f":"IFERROR((VLOOKUP(A99,'Información municipios'!$E$3:$I$1124,5,FALSE)),\"\")","v":""},{"$f":"IFERROR(VLOOKUP(A99,'Información municipios'!$E$3:$F$1124,2,0)*((1+1.75%)^('Datos de entrada'!$B$5-2019)),\"\")","v":""},0]
[{"$f":"IF('Municipios Proyecto Regional'!B99<>0,'Municipios Proyecto Regional'!B99,\"\")","v":""},{"$f":"IFERROR((VLOOKUP(A100,'Información municipios'!$E$3:$I$1124,5,FALSE)),\"\")","v":""},{"$f":"IFERROR(VLOOKUP(A100,'Información municipios'!$E$3:$F$1124,2,0)*((1+1.75%)^('Datos de entrada'!$B$5-2019)),\"\")","v":""},0]
[{"$f":"IF('Municipios Proyecto Regional'!B100<>0,'Municipios Proyecto Regional'!B100,\"\")","v":""},{"$f":"IFERROR((VLOOKUP(A101,'Información municipios'!$E$3:$I$1124,5,FALSE)),\"\")","v":""},{"$f":"IFERROR(VLOOKUP(A101,'Información municipios'!$E$3:$F$1124,2,0)*((1+1.75%)^('Datos de entrada'!$B$5-2019)),\"\")","v":""},0]
[{"$f":"IF('Municipios Proyecto Regional'!B101<>0,'Municipios Proyecto Regional'!B101,\"\")","v":""},{"$f":"IFERROR((VLOOKUP(A102,'Información municipios'!$E$3:$I$1124,5,FALSE)),\"\")","v":""},{"$f":"IFERROR(VLOOKUP(A102,'Información municipios'!$E$3:$F$1124,2,0)*((1+1.75%)^('Datos de entrada'!$B$5-2019)),\"\")","v":""},0]
[{"$f":"IF('Municipios Proyecto Regional'!B102<>0,'Municipios Proyecto Regional'!B102,\"\")","v":""},{"$f":"IFERROR((VLOOKUP(A103,'Información municipios'!$E$3:$I$1124,5,FALSE)),\"\")","v":""},{"$f":"IFERROR(VLOOKUP(A103,'Información municipios'!$E$3:$F$1124,2,0)*((1+1.75%)^('Datos de entrada'!$B$5-2019)),\"\")","v":""},0]
[{"$f":"IF('Municipios Proyecto Regional'!B103<>0,'Municipios Proyecto Regional'!B103,\"\")","v":""},{"$f":"IFERROR((VLOOKUP(A104,'Información municipios'!$E$3:$I$1124,5,FALSE)),\"\")","v":""},{"$f":"IFERROR(VLOOKUP(A104,'Información municipios'!$E$3:$F$1124,2,0)*((1+1.75%)^('Datos de entrada'!$B$5-2019)),\"\")","v":""},0]
[{"$f":"IF('Municipios Proyecto Regional'!B104<>0,'Municipios Proyecto Regional'!B104,\"\")","v":""},{"$f":"IFERROR((VLOOKUP(A105,'Información municipios'!$E$3:$I$1124,5,FALSE)),\"\")","v":""},{"$f":"IFERROR(VLOOKUP(A105,'Información municipios'!$E$3:$F$1124,2,0)*((1+1.75%)^('Datos de entrada'!$B$5-2019)),\"\")","v":""},0]
[{"$f":"IF('Municipios Proyecto Regional'!B105<>0,'Municipios Proyecto Regional'!B105,\"\")","v":""},{"$f":"IFERROR((VLOOKUP(A106,'Información municipios'!$E$3:$I$1124,5,FALSE)),\"\")","v":""},{"$f":"IFERROR(VLOOKUP(A106,'Información municipios'!$E$3:$F$1124,2,0)*((1+1.75%)^('Datos de entrada'!$B$5-2019)),\"\")","v":""},0]
[{"$f":"IF('Municipios Proyecto Regional'!B106<>0,'Municipios Proyecto Regional'!B106,\"\")","v":""},{"$f":"IFERROR((VLOOKUP(A107,'Información municipios'!$E$3:$I$1124,5,FALSE)),\"\")","v":""},{"$f":"IFERROR(VLOOKUP(A107,'Información municipios'!$E$3:$F$1124,2,0)*((1+1.75%)^('Datos de entrada'!$B$5-2019)),\"\")","v":""},0]
[{"$f":"IF('Municipios Proyecto Regional'!B107<>0,'Municipios Proyecto Regional'!B107,\"\")","v":""},{"$f":"IFERROR((VLOOKUP(A108,'Información municipios'!$E$3:$I$1124,5,FALSE)),\"\")","v":""},{"$f":"IFERROR(VLOOKUP(A108,'Información municipios'!$E$3:$F$1124,2,0)*((1+1.75%)^('Datos de entrada'!$B$5-2019)),\"\")","v":""},0]
[{"$f":"IF('Municipios Proyecto Regional'!B108<>0,'Municipios Proyecto Regional'!B108,\"\")","v":""},{"$f":"IFERROR((VLOOKUP(A109,'Información municipios'!$E$3:$I$1124,5,FALSE)),\"\")","v":""},{"$f":"IFERROR(VLOOKUP(A109,'Información municipios'!$E$3:$F$1124,2,0)*((1+1.75%)^('Datos de entrada'!$B$5-2019)),\"\")","v":""},0]
[{"$f":"IF('Municipios Proyecto Regional'!B109<>0,'Municipios Proyecto Regional'!B109,\"\")","v":""},{"$f":"IFERROR((VLOOKUP(A110,'Información municipios'!$E$3:$I$1124,5,FALSE)),\"\")","v":""},{"$f":"IFERROR(VLOOKUP(A110,'Información municipios'!$E$3:$F$1124,2,0)*((1+1.75%)^('Datos de entrada'!$B$5-2019)),\"\")","v":""},0]
[{"$f":"IF('Municipios Proyecto Regional'!B110<>0,'Municipios Proyecto Regional'!B110,\"\")","v":""},{"$f":"IFERROR((VLOOKUP(A111,'Información municipios'!$E$3:$I$1124,5,FALSE)),\"\")","v":""},{"$f":"IFERROR(VLOOKUP(A111,'Información municipios'!$E$3:$F$1124,2,0)*((1+1.75%)^('Datos de entrada'!$B$5-2019)),\"\")","v":""},0]
[{"$f":"IF('Municipios Proyecto Regional'!B111<>0,'Municipios Proyecto Regional'!B111,\"\")","v":""},{"$f":"IFERROR((VLOOKUP(A112,'Información municipios'!$E$3:$I$1124,5,FALSE)),\"\")","v":""},{"$f":"IFERROR(VLOOKUP(A112,'Información municipios'!$E$3:$F$1124,2,0)*((1+1.75%)^('Datos de entrada'!$B$5-2019)),\"\")","v":""},0]
[{"$f":"IF('Municipios Proyecto Regional'!B112<>0,'Municipios Proyecto Regional'!B112,\"\")","v":""},{"$f":"IFERROR((VLOOKUP(A113,'Información municipios'!$E$3:$I$1124,5,FALSE)),\"\")","v":""},{"$f":"IFERROR(VLOOKUP(A113,'Información municipios'!$E$3:$F$1124,2,0)*((1+1.75%)^('Datos de entrada'!$B$5-2019)),\"\")","v":""},0]
[{"$f":"IF('Municipios Proyecto Regional'!B113<>0,'Municipios Proyecto Regional'!B113,\"\")","v":""},{"$f":"IFERROR((VLOOKUP(A114,'Información municipios'!$E$3:$I$1124,5,FALSE)),\"\")","v":""},{"$f":"IFERROR(VLOOKUP(A114,'Información municipios'!$E$3:$F$1124,2,0)*((1+1.75%)^('Datos de entrada'!$B$5-2019)),\"\")","v":""},0]
[{"$f":"IF('Municipios Proyecto Regional'!B114<>0,'Municipios Proyecto Regional'!B114,\"\")","v":""},{"$f":"IFERROR((VLOOKUP(A115,'Información municipios'!$E$3:$I$1124,5,FALSE)),\"\")","v":""},{"$f":"IFERROR(VLOOKUP(A115,'Información municipios'!$E$3:$F$1124,2,0)*((1+1.75%)^('Datos de entrada'!$B$5-2019)),\"\")","v":""},0]
[{"$f":"IF('Municipios Proyecto Regional'!B115<>0,'Municipios Proyecto Regional'!B115,\"\")","v":""},{"$f":"IFERROR((VLOOKUP(A116,'Información municipios'!$E$3:$I$1124,5,FALSE)),\"\")","v":""},{"$f":"IFERROR(VLOOKUP(A116,'Información municipios'!$E$3:$F$1124,2,0)*((1+1.75%)^('Datos de entrada'!$B$5-2019)),\"\")","v":""},0]
[{"$f":"IF('Municipios Proyecto Regional'!B116<>0,'Municipios Proyecto Regional'!B116,\"\")","v":""},{"$f":"IFERROR((VLOOKUP(A117,'Información municipios'!$E$3:$I$1124,5,FALSE)),\"\")","v":""},{"$f":"IFERROR(VLOOKUP(A117,'Información municipios'!$E$3:$F$1124,2,0)*((1+1.75%)^('Datos de entrada'!$B$5-2019)),\"\")","v":""},0]
[{"$f":"IF('Municipios Proyecto Regional'!B117<>0,'Municipios Proyecto Regional'!B117,\"\")","v":""},{"$f":"IFERROR((VLOOKUP(A118,'Información municipios'!$E$3:$I$1124,5,FALSE)),\"\")","v":""},{"$f":"IFERROR(VLOOKUP(A118,'Información municipios'!$E$3:$F$1124,2,0)*((1+1.75%)^('Datos de entrada'!$B$5-2019)),\"\")","v":""},0]
[{"$f":"IF('Municipios Proyecto Regional'!B118<>0,'Municipios Proyecto Regional'!B118,\"\")","v":""},{"$f":"IFERROR((VLOOKUP(A119,'Información municipios'!$E$3:$I$1124,5,FALSE)),\"\")","v":""},{"$f":"IFERROR(VLOOKUP(A119,'Información municipios'!$E$3:$F$1124,2,0)*((1+1.75%)^('Datos de entrada'!$B$5-2019)),\"\")","v":""},0]
[{"$f":"IF('Municipios Proyecto Regional'!B119<>0,'Municipios Proyecto Regional'!B119,\"\")","v":""},{"$f":"IFERROR((VLOOKUP(A120,'Información municipios'!$E$3:$I$1124,5,FALSE)),\"\")","v":""},{"$f":"IFERROR(VLOOKUP(A120,'Información municipios'!$E$3:$F$1124,2,0)*((1+1.75%)^('Datos de entrada'!$B$5-2019)),\"\")","v":""},0]
[{"$f":"IF('Municipios Proyecto Regional'!B120<>0,'Municipios Proyecto Regional'!B120,\"\")","v":""},{"$f":"IFERROR((VLOOKUP(A121,'Información municipios'!$E$3:$I$1124,5,FALSE)),\"\")","v":""},{"$f":"IFERROR(VLOOKUP(A121,'Información municipios'!$E$3:$F$1124,2,0)*((1+1.75%)^('Datos de entrada'!$B$5-2019)),\"\")","v":""},0]
["Mercado a atender"]
[null,"AÑO INICIO","AÑO FIN"]
["Población (habitantes):",{"$f":"ROUNDDOWN(IF('Datos de entrada'!B6=\"Si\",SUM(C2:C121),SUM(C2:C2)),0)","v":313629}]
["Población (habitantes) en operación:",{"$f":"B124*((1+Nacional_Área!I20)^('Datos de entrada'!$B$5-2019))","v":321216.47334604803},{"$f":"INT(B125*((1+Nacional_Área!I20)^(B130)))","v":392022}]
["Toneladas de residuos sólidos por año (sin residuos de poda y corte, ni de plazas de mercado)",{"$f":"IF('Datos de entrada'!$B$9>0, 'Datos de entrada'!$B$9*Resultados!C17*365/1000, Resultados!C17*'Información referencia'!$B$13*365/1000)","v":76208.608301349901},{"$f":"IF('Datos de entrada'!$B$9>0, 'Datos de entrada'!$B$9*C125*365/1000, C125*'Información referencia'!$B$13*365/1000)","v":93007.219500000007}]
["Toneladas de residuos sólidos orgánicos por año  (sin residuos de poda y corte, ni de plazas de mercado)",{"$f":"IF('Datos de entrada'!$B$10>0,'Datos de entrada'!$B$10*Cálculo!$B$126,Cálculo!$B$126*'Información referencia'!$B$14)","v":45725.164980809939},{"$f":"IF('Datos de entrada'!$B$10>0,'Datos de entrada'!$B$10*Cálculo!$C$126,Cálculo!$C$126*'Información referencia'!$B$14)","v":55804.331700000002}]
["Toneladas de residuos sólidos orgánicos provenientes  de poda y corte, y de plazas de mercado por año",{"$f":"++'Datos de entrada'!B12+'Datos de entrada'!B14","v":0},{"$f":"+B128","v":0}]
["Toneladas de residuos sólidos por año (con residuos de poda y corte, y de plazas de mercado)",{"$f":"+'Datos de entrada'!$B$12+'Datos de entrada'!$B$14+$B$126","v":76208.608301349901},{"$f":"+'Datos de entrada'!$B$12+'Datos de entrada'!$B$14+$C$126","v":93007.219500000007}]
["Vida útil del proyecto",{"$f":"IF('Datos de entrada'!$B$8>0,'Datos de entrada'!$B$8,'Información referencia'!$B$10)","v":25}]
[]
[]
["Selección Escenario","Valor","Interpretación"]
["Capacidad Administrativa",{"$f":"IFERROR((VLOOKUP('Datos de entrada'!$B$19,Ponderaciones!$A$12:$B$16,2,FALSE)*Ponderaciones!$F$4)+(VLOOKUP('Datos de entrada'!$B$21,Ponderaciones!$D$12:$E$18,2,FALSE)*Ponderaciones!$F$5)+(VLOOKUP('Datos de entrada'!$B$20,Ponderaciones!$G$12:$H$13,2,FALSE)*Ponderaciones!$F$6+VLOOKUP('Datos de entrada'!$B$22,Ponderaciones!$G$17:$H$19,2,FALSE)*Ponderaciones!$F$7),\"\")","v":7.125},{"$f":"IF($B$134<Ponderaciones!$C$6,Ponderaciones!$A$6,IF($B$134<Ponderaciones!$C$4,Ponderaciones!$A$5,IF($B$134<=10,Ponderaciones!$A$4,\"\")))","v":"Media"}]
["Capacidad Técnica",{"$f":"IFERROR(((VLOOKUP($C$136,Ponderaciones!$A$112:$B$114,2,FALSE)*Ponderaciones!$F$105)+(VLOOKUP($C$137,Ponderaciones!$A$112:$B$114,2,FALSE)*Ponderaciones!$F$106)+(VLOOKUP($C$138,Ponderaciones!$A$112:$B$114,2,FALSE)*Ponderaciones!$F$107)+(VLOOKUP($C$139,Ponderaciones!$A$112:$B$115,2,FALSE)*Ponderaciones!$F$108)),\"\")","v":8},{"$f":"IF($B$135<Ponderaciones!$C$107,Ponderaciones!$A$107,IF($B$135<Ponderaciones!$C$105,Ponderaciones!$A$106,IF($B$135<=10,Ponderaciones!$A$105,\"\")))","v":"Alta"}]
["Separación en la fuente",{"$f":"IFERROR((VLOOKUP('Datos de entrada'!$B$26,Ponderaciones!$A$32:$B$33,2,FALSE)*Ponderaciones!$F$24)+(VLOOKUP('Datos de entrada'!$B$27,Ponderaciones!$D$32:$E$33,2,FALSE)*Ponderaciones!$F$25)+(VLOOKUP('Datos de entrada'!$B$29,Ponderaciones!$G$32:$H$35,2,FALSE)*Ponderaciones!$F$26),\"\")","v":6.4},{"$f":"IF($B$136<Ponderaciones!$C$26,Ponderaciones!$A$26,IF($B$136<Ponderaciones!$C$24,Ponderaciones!A25,IF($B$136<=10,Ponderaciones!$A$24,\"\")))","v":"Media"}]
["Recolección y transporte",{"$f":"IFERROR((VLOOKUP('Datos de entrada'!$B$32,Ponderaciones!$A$49:$B$52,2,FALSE)*Ponderaciones!$F$41)+(VLOOKUP('Datos de entrada'!$B$33,Ponderaciones!$A$49:$B$52,2,FALSE)*Ponderaciones!$F$42)+(VLOOKUP('Datos de entrada'!$B$35,Ponderaciones!$D$49:$E$53,2,FALSE)*Ponderaciones!$F$43)+(VLOOKUP('Datos de entrada'!$B$36,Ponderaciones!$G$49:$H$53,2,FALSE)*Ponderaciones!$F$44),\"\")","v":8.1999999999999993},{"$f":"IF($B$137<Ponderaciones!$C$43,Ponderaciones!$A$43,IF($B$137<Ponderaciones!$C$41,Ponderaciones!$A$42,IF($B$137<=10,Ponderaciones!$A$41,\"\")))","v":"Alta"}]
["Tratamiento y disposición final",{"$f":"IFERROR((VLOOKUP('Datos de entrada'!$B$39,Ponderaciones!$A$68:$B$72,2,FALSE)*Ponderaciones!$F$59)+(VLOOKUP('Datos de entrada'!$B$40,Ponderaciones!$D$68:$E$69,2,FALSE)*Ponderaciones!$F$60)+(VLOOKUP('Datos de entrada'!$B$41,Ponderaciones!$G$68:$H$72,2,FALSE)*Ponderaciones!$F$61)+(VLOOKUP('Datos de entrada'!$B$42,Ponderaciones!$A$77:$B$81,2,FALSE)*Ponderaciones!$F$62)+(VLOOKUP('Datos de entrada'!$B$43,Ponderaciones!$D$77:$E$79,2,FALSE)*Ponderaciones!$F$63),\"\")","v":7.6000000000000005},{"$f":"IF($B$138<Ponderaciones!$C$61,Ponderaciones!$A$61,IF($B$138<Ponderaciones!$C$59,Ponderaciones!$A$60,IF($B$138<=10,Ponderaciones!$A$59,\"\")))","v":"Media"}]
["Uso de suelo",{"$f":"IFERROR((VLOOKUP('Datos de entrada'!$B$46,Ponderaciones!A94:$B$95,2,FALSE)*Ponderaciones!$F$86)+(VLOOKUP('Datos de entrada'!$B$47,Ponderaciones!D94:$E$95,2,FALSE)*Ponderaciones!$F$87)+(VLOOKUP('Datos de entrada'!$B$48,Ponderaciones!G94:$H$95,2,FALSE)*Ponderaciones!$F$88)+(VLOOKUP('Datos de entrada'!$B$49,Ponderaciones!A99:$B$100,2,FALSE)*Ponderaciones!$F$89),\"\")","v":9.1},{"$f":"IF($B$139<Ponderaciones!$C$88,Ponderaciones!$A$88,IF($B$139<Ponderaciones!$C$86,Ponderaciones!$A$87,Ponderaciones!$A$86))","v":"Alta"}]
["Capacidad Económica",{"$f":"IFERROR((VLOOKUP('Datos de entrada'!$B$54,Ponderaciones!$A$127:$B$128,2,FALSE)*Ponderaciones!$F$120)+(VLOOKUP('Datos de entrada'!$B$55,Ponderaciones!$D$127:$E$128,2,FALSE)*Ponderaciones!$F$121)+(VLOOKUP('Datos de entrada'!$B$56,Ponderaciones!$G$127:$H$131,2,FALSE)*Ponderaciones!$F$122)+((VLOOKUP('Datos de entrada'!$B$57,Ponderaciones!$A$133:$B$137,2,FALSE)*Ponderaciones!$F$123)),\"\")","v":5.2},{"$f":"IF($B$140<Ponderaciones!$C$122,Ponderaciones!A122,IF($B$140<Ponderaciones!$C$120,Ponderaciones!$A$121,IF($B$140<=10,Ponderaciones!$A$120,\"\")))","v":"Media"}]
["Resultado","Escenario","Nivel de favorabilidad"]
[null,{"$f":"IFERROR(INDEX(Ponderaciones!$G$145:$G$172,MATCH($C$134&$C$135&$C$140,INDEX(Ponderaciones!$D$145:$D$172&Ponderaciones!$E$145:$E$172&Ponderaciones!$F$145:$F$172,),0),1),\"\")","v":2},{"$f":"IFERROR(VLOOKUP(B142,Ponderaciones!$A$145:$B$150,2,FALSE),\"\")","v":"Alta"}]
[]
[]
["Viabilidad Tratamiento",{"$f":"IF(OR($B$142=1,$B$142=2,$B$142=3), 'Medidas Escenarios'!$B$7, IF('Datos de entrada'!$B$36=Ponderaciones!$G$49, 'Medidas Escenarios'!$B$9,'Medidas Escenarios'!$B$8))","v":"Dado el contexto del proyecto, es recomendable continuar con las siguientes fases de planeación para el tratamiento de residuos sólidos órganicos implementando una o la combinación de las tecnologías identificadas en este reporte. Las alternativas contempladas se basan en tecnologías probadas (el análisis de tecnologias no convencionales deberá tener el cuenta lo establecido en el reglamento técnico para el sector de agua potable y saneamiento RAS)."}]
["Medidas a implementar",{"$f":"IFERROR(VLOOKUP($B$142,'Medidas Escenarios'!$A$1:$B$6,2,FALSE),\"\")","v":"1) Actualice el PGIRS, que prevea la viabilidad de proyectos para el tratamiento de residuos sólidos. Para ello como mínimo debe realizarse la actualización o elaboración de:\na. Caracterización de residuos con especial énfasis en la fracción orgánica\nb. Estudios técnico-operativos para determinar el tipo de tratamiento más viable\nc. Estudios de mercado que permitan determinar la viabilidad del tratamiento\n2) Fortalezca la capacidad administrativa de los municipios revisando los indicadores de gestión y resultados de la Medición de Desempeño Municipal (MDM) en los cuales existen falencias.\n3) Amplie la destinación de recursos para financiar actividades del servicio público de aseo\n4) Implemente sistemas de extracción y aprovechamiento de biogás en el sitio de disposición final\n5) Implemente un sistema de Monitoreo, Reporte y Verificación (MRV) de emisiones de la reducción de emisiones de GEI\n6) Actualice la infraestructura para la presentación de los residuos sólidos para adoptar el código de colores establecido en la Resolución 2184 de 2019.\n"}]
[]
[]
[]
[]
[]
[]
[]
[null,null,null,null,null,null,null,null,null,null,null,null,null,null,null,null,null,null,null,null,null,null,null,"TRATAMIENTO DE PODA, CORTE DE CESPED Y PLAZAS DE MERCADO"]
["Valoración","Mejor opción","Evaluación de tecnologías","Cumplimiento requerimientos (%)","Valoración","Costos de inversión (COP)","Costos de operación (COP) (a lo largo de la vida útil)","Costos totales (COP) (a lo largo de la vida útil)","Alternativa más económica","Valoración","Ingresos por tarifa (COP) (a lo largo de la vida útil)","Ingresos por comercialización (COP) (vida útil)","Ingresos totales (COP) (vida útil)","Relación costo beneficio","Valoración","Potencial de desvío de residuos a relleno sanitario (tpa) - límite inferior / Jerarquía resultados","Valoración","Potencial de desvío de residuos a relleno sanitario (tpa) - límite superior / Jerarquía resultados","Valoración","Potencial de reducción de emisión de GEI","Valoración","Tecnología más apropiada","Valoración","Ingresos por tarifa (COP) (a lo largo de la vida útil)","Ingresos por comercialización (COP) (vida útil)","Ingresos totales (COP) (vida útil)"]
[{"$f":"(IFERROR((W156*Ponderaciones!$F$180)+(Cálculo!O156*Ponderaciones!$F$181)+(Cálculo!Q156*Ponderaciones!$F$182)+(Cálculo!S156*Ponderaciones!$F$183)+(Cálculo!U156*Ponderaciones!$F$184)+(J156*Ponderaciones!$F$185),\"\"))*IF(B127>Valoración!C3,0,1)","v":6.1},{"$f":"IFERROR(_xlfn.RANK.EQ(A156,$A$156:$A$160,0),\"\")","v":1},{"$f":"+'Fichas técnicas Tecnologías'!$A$3","v":"Compostaje en pilas con volteo manual"},{"$f":"Valoración!M3","v":0.33333333333333331},{"$f":"IF(D156<=Ponderaciones!$A$194,Ponderaciones!$B$194,IF(D156<=Ponderaciones!$A$193,Ponderaciones!$B$193, IF(D156<=Ponderaciones!$A$192,Ponderaciones!$B$192,IF(D156<=Ponderaciones!$A$191,Ponderaciones!$B$191,Ponderaciones!$B$190))))","v":3},{"$f":"'Costos de inversión'!$N$17*(1.03^('Datos de entrada'!$B$5-2021))","v":6122513710.04},{"$f":"+'Costos de operación'!$N$13*(1.03^('Datos de entrada'!$B$5-2021))","v":0},{"$f":"F156+G156","v":6122513710.04},{"$f":"_xlfn.RANK.EQ(H156,$H$156:$H$160,1)","v":1},{"$f":"IFERROR(IF(I156=Ponderaciones!$G$190,Ponderaciones!$H$190,IF(I156=Ponderaciones!$G$191,Ponderaciones!$H$191,IF(I156=Ponderaciones!$G$192,Ponderaciones!$H$192,Ponderaciones!$H$193))),\"\")","v":10},{"$f":"ROUND('Datos de entrada'!$B$59*$B$127*'Datos de entrada'!$B$8*(1.03^('Datos de entrada'!$B$5-2021)),-6)","v":82420000000},{"$f":"ROUND($B$128*'Datos de entrada'!$B$8*'Fichas técnicas Tecnologías'!$Q$3*'Fichas técnicas Tecnologías'!$R$3*'Datos de entrada'!$B$61,-6)","v":0},{"$f":"+K156+L156","v":82420000000},{"$f":"IF(M156/H156<1,Ponderaciones!$D$192,IF(M156/H156=1,Ponderaciones!$D$191,IF(M156/H156>1,Ponderaciones!$D$190,\"Error\")))","v":"Mayor a 1"},{"$f":"IF(N156=Ponderaciones!$D$190,Ponderaciones!$E$190,IF(N156=Ponderaciones!$D$191,Ponderaciones!$E$191,IF(N156=Ponderaciones!$D$192,Ponderaciones!$E$192,\"\")))","v":10},{"$f":"'Fichas técnicas Tecnologías'!Z3*'Fichas técnicas Tecnologías'!N3","v":8573.468433901864},{"$f":"IF(_xlfn.RANK.EQ(P156,$P$156:$P$160,0)=Ponderaciones!$G$190,Ponderaciones!$H$190,IF(_xlfn.RANK.EQ(P156,$P$156:$P$160,0)=Ponderaciones!$G$191,Ponderaciones!$H$191,IF(_xlfn.RANK.EQ(P156,$P$156:$P$160,0)=Ponderaciones!$G$192,Ponderaciones!$H$192,Ponderaciones!$H$193)))","v":4},{"$f":"($B$127)*'Fichas técnicas Tecnologías'!O3","v":17375.562692707776},{"$f":"IFERROR(IF(_xlfn.RANK.EQ(R156,$R$156:$R$160,0)=Ponderaciones!$A$199,Ponderaciones!$B$199,IF(_xlfn.RANK.EQ(R156,$R$156:$R$160,0)=Ponderaciones!$A$200,Ponderaciones!$B$200, IF(_xlfn.RANK.EQ(R156,$R$156:$R$160,0)=Ponderaciones!$A$201,Ponderaciones!$B$201,Ponderaciones!$B$202))),\"\")","v":4},{"$f":"'Fichas técnicas Tecnologías'!P3","v":0.42},{"$f":"IFERROR(IF(T156<=Ponderaciones!$D$203,Ponderaciones!$E$203,IF(T156<=Ponderaciones!$D$202,Ponderaciones!$E$202,IF(T156<=Ponderaciones!$D$201,Ponderaciones!$E$201,IF(T156<=Ponderaciones!$D$200,Ponderaciones!$E$200,Ponderaciones!$E$199)))),\"\")","v":4},{"$f":"IF(VLOOKUP(ROUNDDOWN(AVERAGE($B$2:$B$121),0),'Información municipios'!$O$3:$S$6,4,FALSE)=Cálculo!C156,Ponderaciones!$A$190,IF(VLOOKUP(ROUNDDOWN(AVERAGE($B$2:$B$121),0),'Información municipios'!$O$3:$S$6,5,FALSE)=Cálculo!C156,Ponderaciones!$A$191,Ponderaciones!$A$192))","v":"Tecología más apropiada"},{"$f":"IFERROR(VLOOKUP(V156,Ponderaciones!$A$190:$B$192,2,FALSE)*Ponderaciones!$F$180,\"\")","v":4},{"$f":"'Datos de entrada'!$B$59*$B$128*'Datos de entrada'!$B$8*(1.03^('Datos de entrada'!$B$5-2021))","v":0},{"$f":"$B$128*'Datos de entrada'!$B$8*'Fichas técnicas Tecnologías'!$Q$3*'Fichas técnicas Tecnologías'!$R$3*'Datos de entrada'!$B$61*(1.03^('Datos de entrada'!$B$5-2021))","v":0},{"$f":"+X156+Y156","v":0}]
[{"$f":"IFERROR((W157*Ponderaciones!$F$180)+(Cálculo!O157*Ponderaciones!$F$181)+(Cálculo!Q157*Ponderaciones!$F$182)+(Cálculo!S157*Ponderaciones!$F$183)+(Cálculo!U157*Ponderaciones!$F$184)+(J157*Ponderaciones!$F$185),\"\")*IF(B127>Valoración!C4,0,1)","v":4.7},{"$f":"IFERROR(_xlfn.RANK.EQ(A157,$A$156:$A$160,0),\"\")","v":3},{"$f":"+'Fichas técnicas Tecnologías'!$A$4","v":"Compostaje en pilas con aireación forzada"},{"$f":"Valoración!M4","v":0.33333333333333331},{"$f":"IF(D157<=Ponderaciones!$A$194,Ponderaciones!$B$194,IF(D157<=Ponderaciones!$A$193,Ponderaciones!$B$193, IF(D157<=Ponderaciones!$A$192,Ponderaciones!$B$192,IF(D157<=Ponderaciones!$A$191,Ponderaciones!$B$191,Ponderaciones!$B$190))))","v":3},{"$f":"+'Costos de inversión'!$N$38*(1.03^('Datos de entrada'!$B$5-2021))","v":6993073122.4300003},{"$f":"+'Costos de operación'!$N$28*(1.03^('Datos de entrada'!$B$5-2021))","v":0},{"$f":"F157+G157","v":6993073122.4300003},{"$f":"_xlfn.RANK.EQ(H157,$H$156:$H$160,1)","v":2},{"$f":"IFERROR(IF(I157=Ponderaciones!$G$190,Ponderaciones!$H$190,IF(I157=Ponderaciones!$G$191,Ponderaciones!$H$191,IF(I157=Ponderaciones!$G$192,Ponderaciones!$H$192,Ponderaciones!$H$193))),\"\")","v":8},{"$f":"ROUND('Datos de entrada'!$B$59*$B$127*'Datos de entrada'!$B$8*(1.03^('Datos de entrada'!$B$5-2021)),-6)","v":82420000000},{"$f":"ROUND($B$128*'Datos de entrada'!$B$8*'Fichas técnicas Tecnologías'!$Q$4*'Fichas técnicas Tecnologías'!$R$4*'Datos de entrada'!$B$61,-6)","v":0},{"$f":"+K157+L157","v":82420000000},{"$f":"IF(M157/H157<1,Ponderaciones!$D$192,IF(M157/H157=1,Ponderaciones!$D$191,IF(M157/H157>1,Ponderaciones!$D$190,\"Error\")))","v":"Mayor a 1"},{"$f":"IF(N157=Ponderaciones!$D$190,Ponderaciones!$E$190,IF(N157=Ponderaciones!$D$191,Ponderaciones!$E$191,IF(N157=Ponderaciones!$D$192,Ponderaciones!$E$192,\"\")))","v":10},{"$f":"'Fichas técnicas Tecnologías'!Z4*'Fichas técnicas Tecnologías'!N4","v":9218.1932601312856},{"$f":"IF(_xlfn.RANK.EQ(P157,$P$156:$P$160,0)=Ponderaciones!$G$190,Ponderaciones!$H$190,IF(_xlfn.RANK.EQ(P157,$P$156:$P$160,0)=Ponderaciones!$G$191,Ponderaciones!$H$191,IF(_xlfn.RANK.EQ(P157,$P$156:$P$160,0)=Ponderaciones!$G$192,Ponderaciones!$H$192,Ponderaciones!$H$193)))","v":4},{"$f":"$B$127*'Fichas técnicas Tecnologías'!O4","v":18747.317642132075},{"$f":"IFERROR(IF(_xlfn.RANK.EQ(R157,$R$156:$R$160,0)=Ponderaciones!$A$199,Ponderaciones!$B$199,IF(_xlfn.RANK.EQ(R157,$R$156:$R$160,0)=Ponderaciones!$A$200,Ponderaciones!$B$200, IF(_xlfn.RANK.EQ(R157,$R$156:$R$160,0)=Ponderaciones!$A$201,Ponderaciones!$B$201,Ponderaciones!$B$202))),\"\")","v":4},{"$f":"'Fichas técnicas Tecnologías'!P4","v":0.4},{"$f":"IFERROR(IF(T157<=Ponderaciones!$D$203,Ponderaciones!$E$203,IF(T157<=Ponderaciones!$D$202,Ponderaciones!$E$202,IF(T157<=Ponderaciones!$D$201,Ponderaciones!$E$201,IF(T157<=Ponderaciones!$D$200,Ponderaciones!$E$200,Ponderaciones!$E$199)))),\"\")","v":4},{"$f":"IF(VLOOKUP(ROUNDDOWN(AVERAGE($B$2:$B$121),0),'Información municipios'!$O$3:$S$6,4,FALSE)=Cálculo!C157,Ponderaciones!$A$190,IF(VLOOKUP(ROUNDDOWN(AVERAGE($B$2:$B$121),0),'Información municipios'!$O$3:$S$6,5,FALSE)=Cálculo!C157,Ponderaciones!$A$191,Ponderaciones!$A$192))","v":"Tecnología apropiada "},{"$f":"IFERROR(VLOOKUP(V157,Ponderaciones!$A$190:$B$192,2,FALSE)*Ponderaciones!$F$180,\"\")","v":2},{"$f":"'Datos de entrada'!$B$59*$B$128*'Datos de entrada'!$B$8*(1.03^('Datos de entrada'!$B$5-2021))","v":0},{"$f":"$B$128*'Datos de entrada'!$B$8*'Fichas técnicas Tecnologías'!$Q$3*'Fichas técnicas Tecnologías'!$R$3*'Datos de entrada'!$B$61*(1.03^('Datos de entrada'!$B$5-2021))","v":0},{"$f":"+X157+Y157","v":0}]
[{"$f":"IFERROR((W158*Ponderaciones!$F$180)+(Cálculo!O158*Ponderaciones!$F$181)+(Cálculo!Q158*Ponderaciones!$F$182)+(Cálculo!S158*Ponderaciones!$F$183)+(Cálculo!U158*Ponderaciones!$F$184)+(J158*Ponderaciones!$F$185),\"\")","v":3.6799999999999997},{"$f":"IFERROR(_xlfn.RANK.EQ(A158,$A$156:$A$160,0),\"\")","v":5},{"$f":"+'Fichas técnicas Tecnologías'!$A$5","v":"Compostaje cerrado o \"In vessel\""},{"$f":"Valoración!M5","v":0.33333333333333331},{"$f":"IF(D158<=Ponderaciones!$A$194,Ponderaciones!$B$194,IF(D158<=Ponderaciones!$A$193,Ponderaciones!$B$193, IF(D158<=Ponderaciones!$A$192,Ponderaciones!$B$192,IF(D158<=Ponderaciones!$A$191,Ponderaciones!$B$191,Ponderaciones!$B$190))))","v":3},{"$f":"+'Costos de inversión'!$N$58*(1.03^('Datos de entrada'!$B$5-2021))","v":7746473992.0799999},{"$f":"+'Costos de operación'!$N$42*(1.03^('Datos de entrada'!$B$5-2021))","v":0},{"$f":"F158+G158","v":7746473992.0799999},{"$f":"_xlfn.RANK.EQ(H158,$H$156:$H$160,1)","v":4},{"$f":"IFERROR(IF(I158=Ponderaciones!$G$190,Ponderaciones!$H$190,IF(I158=Ponderaciones!$G$191,Ponderaciones!$H$191,IF(I158=Ponderaciones!$G$192,Ponderaciones!$H$192,Ponderaciones!$H$193))),\"\")","v":4},{"$f":"ROUND('Datos de entrada'!$B$59*$B$127*'Datos de entrada'!$B$8*(1.03^('Datos de entrada'!$B$5-2021)),-6)","v":82420000000},{"$f":"ROUND($B$128*'Datos de entrada'!$B$8*'Fichas técnicas Tecnologías'!$Q$5*'Fichas técnicas Tecnologías'!$R$5*'Datos de entrada'!$B$61,-6)*0","v":0},{"$f":"+K158+L158","v":82420000000},{"$f":"IF(M158/H158<1,Ponderaciones!$D$192,IF(M158/H158=1,Ponderaciones!$D$191,IF(M158/H158>1,Ponderaciones!$D$190,\"Error\")))","v":"Mayor a 1"},{"$f":"IF(N158=Ponderaciones!$D$190,Ponderaciones!$E$190,IF(N158=Ponderaciones!$D$191,Ponderaciones!$E$191,IF(N158=Ponderaciones!$D$192,Ponderaciones!$E$192,\"\")))","v":10},{"$f":"'Fichas técnicas Tecnologías'!Z5*'Fichas técnicas Tecnologías'!N5","v":11413.00117921016},{"$f":"IF(_xlfn.RANK.EQ(P158,$P$156:$P$160,0)=Ponderaciones!$G$190,Ponderaciones!$H$190,IF(_xlfn.RANK.EQ(P158,$P$156:$P$160,0)=Ponderaciones!$G$191,Ponderaciones!$H$191,IF(_xlfn.RANK.EQ(P158,$P$156:$P$160,0)=Ponderaciones!$G$192,Ponderaciones!$H$192,Ponderaciones!$H$193)))","v":8},{"$f":"$B$127*'Fichas técnicas Tecnologías'!O5","v":23777.08579002117},{"$f":"IFERROR(IF(_xlfn.RANK.EQ(R158,$R$156:$R$160,0)=Ponderaciones!$A$199,Ponderaciones!$B$199,IF(_xlfn.RANK.EQ(R158,$R$156:$R$160,0)=Ponderaciones!$A$200,Ponderaciones!$B$200, IF(_xlfn.RANK.EQ(R158,$R$156:$R$160,0)=Ponderaciones!$A$201,Ponderaciones!$B$201,Ponderaciones!$B$202))),\"\")","v":6},{"$f":"'Fichas técnicas Tecnologías'!P5","v":0.38},{"$f":"IFERROR(IF(T158<=Ponderaciones!$D$203,Ponderaciones!$E$203,IF(T158<=Ponderaciones!$D$202,Ponderaciones!$E$202,IF(T158<=Ponderaciones!$D$201,Ponderaciones!$E$201,IF(T158<=Ponderaciones!$D$200,Ponderaciones!$E$200,Ponderaciones!$E$199)))),\"\")","v":4},{"$f":"IF(VLOOKUP(ROUNDDOWN(AVERAGE($B$2:$B$121),0),'Información municipios'!$O$3:$S$6,4,FALSE)=Cálculo!C158,Ponderaciones!$A$190,IF(VLOOKUP(ROUNDDOWN(AVERAGE($B$2:$B$121),0),'Información municipios'!$O$3:$S$6,5,FALSE)=Cálculo!C158,Ponderaciones!$A$191,Ponderaciones!$A$192))","v":"Tecnología no apropiada"},{"$f":"IFERROR(VLOOKUP(V158,Ponderaciones!$A$190:$B$192,2,FALSE)*Ponderaciones!$F$180,\"\")","v":1.2000000000000002},{"$f":"'Datos de entrada'!$B$59*$B$128*'Datos de entrada'!$B$8*(1.03^('Datos de entrada'!$B$5-2021))","v":0},{"$f":"$B$128*'Datos de entrada'!$B$8*'Fichas técnicas Tecnologías'!$Q$3*'Fichas técnicas Tecnologías'!$R$3*'Datos de entrada'!$B$61*(1.03^('Datos de entrada'!$B$5-2021))","v":0},{"$f":"+X158+Y158","v":0}]
[{"$f":"IFERROR((W159*Ponderaciones!$F$180)+(Cálculo!O159*Ponderaciones!$F$181)+(Cálculo!Q159*Ponderaciones!$F$182)+(Cálculo!S159*Ponderaciones!$F$183)+(Cálculo!U159*Ponderaciones!$F$184)+(J159*Ponderaciones!$F$185),\"\")","v":5.08},{"$f":"IFERROR(_xlfn.RANK.EQ(A159,$A$156:$A$160,0),\"\")","v":2},{"$f":"+'Fichas técnicas Tecnologías'!$A$6","v":"Tratamiento Mecánico Biológico"},{"$f":"Valoración!M6","v":1},{"$f":"IF(D159<=Ponderaciones!$A$194,Ponderaciones!$B$194,IF(D159<=Ponderaciones!$A$193,Ponderaciones!$B$193, IF(D159<=Ponderaciones!$A$192,Ponderaciones!$B$192,IF(D159<=Ponderaciones!$A$191,Ponderaciones!$B$191,Ponderaciones!$B$190))))","v":3},{"$f":"+'Costos de inversión'!$N$75*(1.03^('Datos de entrada'!$B$5-2021))","v":7063943942.0600004},{"$f":"+'Costos de operación'!$N$58*(1.03^('Datos de entrada'!$B$5-2021))","v":0},{"$f":"F159+G159","v":7063943942.0600004},{"$f":"_xlfn.RANK.EQ(H159,$H$156:$H$160,1)","v":3},{"$f":"IFERROR(IF(I159=Ponderaciones!$G$190,Ponderaciones!$H$190,IF(I159=Ponderaciones!$G$191,Ponderaciones!$H$191,IF(I159=Ponderaciones!$G$192,Ponderaciones!$H$192,Ponderaciones!$H$193))),\"\")","v":6},{"$f":"ROUND('Datos de entrada'!$B$59*$B$127*'Datos de entrada'!$B$8*(1.03^('Datos de entrada'!$B$5-2021)),-6)","v":82420000000},{"$f":"ROUND($B$128*'Datos de entrada'!$B$8*'Fichas técnicas Tecnologías'!$Q$6*'Fichas técnicas Tecnologías'!$R$6*'Datos de entrada'!$B$61,-6)","v":0},{"$f":"+K159+L159","v":82420000000},{"$f":"IF(M159/H159<1,Ponderaciones!$D$192,IF(M159/H159=1,Ponderaciones!$D$191,IF(M159/H159>1,Ponderaciones!$D$190,\"Error\")))","v":"Mayor a 1"},{"$f":"IF(N159=Ponderaciones!$D$190,Ponderaciones!$E$190,IF(N159=Ponderaciones!$D$191,Ponderaciones!$E$191,IF(N159=Ponderaciones!$D$192,Ponderaciones!$E$192,\"\")))","v":10},{"$f":"'Fichas técnicas Tecnologías'!X6*'Fichas técnicas Tecnologías'!N6","v":27600},{"$f":"IF(_xlfn.RANK.EQ(P159,$P$156:$P$160,0)=Ponderaciones!$G$190,Ponderaciones!$H$190,IF(_xlfn.RANK.EQ(P159,$P$156:$P$160,0)=Ponderaciones!$G$191,Ponderaciones!$H$191,IF(_xlfn.RANK.EQ(P159,$P$156:$P$160,0)=Ponderaciones!$G$192,Ponderaciones!$H$192,Ponderaciones!$H$193)))","v":10},{"$f":"($B$126)*'Fichas técnicas Tecnologías'!O6","v":57156.456226012422},{"$f":"IFERROR(IF(_xlfn.RANK.EQ(R159,$R$156:$R$160,0)=Ponderaciones!$A$199,Ponderaciones!$B$199,IF(_xlfn.RANK.EQ(R159,$R$156:$R$160,0)=Ponderaciones!$A$200,Ponderaciones!$B$200, IF(_xlfn.RANK.EQ(R159,$R$156:$R$160,0)=Ponderaciones!$A$201,Ponderaciones!$B$201,Ponderaciones!$B$202))),\"\")","v":10},{"$f":"'Fichas técnicas Tecnologías'!P6","v":0.68},{"$f":"IFERROR(IF(T159<=Ponderaciones!$D$203,Ponderaciones!$E$203,IF(T159<=Ponderaciones!$D$202,Ponderaciones!$E$202,IF(T159<=Ponderaciones!$D$201,Ponderaciones!$E$201,IF(T159<=Ponderaciones!$D$200,Ponderaciones!$E$200,Ponderaciones!$E$199)))),\"\")","v":8},{"$f":"IF(VLOOKUP(ROUNDDOWN(AVERAGE($B$2:$B$121),0),'Información municipios'!$O$3:$S$6,4,FALSE)=Cálculo!C159,Ponderaciones!$A$190,IF(VLOOKUP(ROUNDDOWN(AVERAGE($B$2:$B$121),0),'Información municipios'!$O$3:$S$6,5,FALSE)=Cálculo!C159,Ponderaciones!$A$191,Ponderaciones!$A$192))","v":"Tecnología no apropiada"},{"$f":"IFERROR(VLOOKUP(V159,Ponderaciones!$A$190:$B$192,2,FALSE)*Ponderaciones!$F$180,\"\")","v":1.2000000000000002},{"$f":"'Datos de entrada'!$B$59*$B$128*'Datos de entrada'!$B$8*(1.03^('Datos de entrada'!$B$5-2021))","v":0},{"$f":"$B$128*'Datos de entrada'!$B$8*'Fichas técnicas Tecnologías'!$Q$3*'Fichas técnicas Tecnologías'!$R$3*'Datos de entrada'!$B$61*(1.03^('Datos de entrada'!$B$5-2021))","v":0},{"$f":"+X159+Y159","v":0}]
[{"$f":"IFERROR((W160*Ponderaciones!$F$180)+(Cálculo!O160*Ponderaciones!$F$181)+(Cálculo!Q160*Ponderaciones!$F$182)+(Cálculo!S160*Ponderaciones!$F$183)+(Cálculo!U160*Ponderaciones!$F$184)+(J160*Ponderaciones!$F$185),\"\")","v":3.7800000000000002},{"$f":"IFERROR(_xlfn.RANK.EQ(A160,$A$156:$A$160,0),\"\")","v":4},{"$f":"+'Fichas técnicas Tecnologías'!$A$9","v":"Digestión Anaerobia"},{"$f":"Valoración!M7","v":0.66666666666666663},{"$f":"IF(D160<=Ponderaciones!$A$194,Ponderaciones!$B$194,IF(D160<=Ponderaciones!$A$193,Ponderaciones!$B$193, IF(D160<=Ponderaciones!$A$192,Ponderaciones!$B$192,IF(D160<=Ponderaciones!$A$191,Ponderaciones!$B$191,Ponderaciones!$B$190))))","v":3},{"$f":"+'Costos de inversión'!$N$89*(1.03^('Datos de entrada'!$B$5-2021))","v":29166834044.18},{"$f":"+'Costos de operación'!$N$74*(1.03^('Datos de entrada'!$B$5-2021))","v":0},{"$f":"F160+G160","v":29166834044.18},{"$f":"_xlfn.RANK.EQ(H160,$H$156:$H$160,1)","v":5},{"$f":"IFERROR(IF(I160=Ponderaciones!$G$190,Ponderaciones!$H$190,IF(I160=Ponderaciones!$G$191,Ponderaciones!$H$191,IF(I160=Ponderaciones!$G$192,Ponderaciones!$H$192,Ponderaciones!$H$193))),\"\")","v":4},{"$f":"ROUND('Datos de entrada'!$B$59*$B$127*'Datos de entrada'!$B$8*(1.03^('Datos de entrada'!$B$5-2021)),-6)","v":82420000000},{"$f":"ROUND($B$128*'Datos de entrada'!$B$8*'Fichas técnicas Tecnologías'!$Q$9*'Fichas técnicas Tecnologías'!$R$9*'Datos de entrada'!$B$61,-6)*0","v":0},{"$f":"+K160+L160","v":82420000000},{"$f":"IF(M160/H160<1,Ponderaciones!$D$192,IF(M160/H160=1,Ponderaciones!$D$191,IF(M160/H160>1,Ponderaciones!$D$190,\"Error\")))","v":"Mayor a 1"},{"$f":"IF(N160=Ponderaciones!$D$190,Ponderaciones!$E$190,IF(N160=Ponderaciones!$D$191,Ponderaciones!$E$191,IF(N160=Ponderaciones!$D$192,Ponderaciones!$E$192,\"\")))","v":10},{"$f":"'Fichas técnicas Tecnologías'!Z9*'Fichas técnicas Tecnologías'!N9","v":10109.833977257078},{"$f":"IF(_xlfn.RANK.EQ(P160,$P$156:$P$160,0)=Ponderaciones!$G$190,Ponderaciones!$H$190,IF(_xlfn.RANK.EQ(P160,$P$156:$P$160,0)=Ponderaciones!$G$191,Ponderaciones!$H$191,IF(_xlfn.RANK.EQ(P160,$P$156:$P$160,0)=Ponderaciones!$G$192,Ponderaciones!$H$192,Ponderaciones!$H$193)))","v":6},{"$f":"$B$127*'Fichas técnicas Tecnologías'!O9","v":29721.357237526463},{"$f":"IFERROR(IF(_xlfn.RANK.EQ(R160,$R$156:$R$160,0)=Ponderaciones!$A$199,Ponderaciones!$B$199,IF(_xlfn.RANK.EQ(R160,$R$156:$R$160,0)=Ponderaciones!$A$200,Ponderaciones!$B$200, IF(_xlfn.RANK.EQ(R160,$R$156:$R$160,0)=Ponderaciones!$A$201,Ponderaciones!$B$201,Ponderaciones!$B$202))),\"\")","v":8},{"$f":"'Fichas técnicas Tecnologías'!P9","v":0.57999999999999996},{"$f":"IFERROR(IF(T160<=Ponderaciones!$D$203,Ponderaciones!$E$203,IF(T160<=Ponderaciones!$D$202,Ponderaciones!$E$202,IF(T160<=Ponderaciones!$D$201,Ponderaciones!$E$201,IF(T160<=Ponderaciones!$D$200,Ponderaciones!$E$200,Ponderaciones!$E$199)))),\"\")","v":6},{"$f":"IF(VLOOKUP(ROUNDDOWN(AVERAGE($B$2:$B$121),0),'Información municipios'!$O$3:$S$6,4,FALSE)=Cálculo!C160,Ponderaciones!$A$190,IF(VLOOKUP(ROUNDDOWN(AVERAGE($B$2:$B$121),0),'Información municipios'!$O$3:$S$6,5,FALSE)=Cálculo!C160,Ponderaciones!$A$191,Ponderaciones!$A$192))","v":"Tecnología no apropiada"},{"$f":"IFERROR(VLOOKUP(V160,Ponderaciones!$A$190:$B$192,2,FALSE)*Ponderaciones!$F$180,\"\")","v":1.2000000000000002},{"$f":"'Datos de entrada'!$B$59*$B$128*'Datos de entrada'!$B$8*(1.03^('Datos de entrada'!$B$5-2021))","v":0},{"$f":"$B$128*'Datos de entrada'!$B$8*'Fichas técnicas Tecnologías'!$Q$3*'Fichas técnicas Tecnologías'!$R$3*'Datos de entrada'!$B$61*(1.03^('Datos de entrada'!$B$5-2021))","v":0},{"$f":"+X160+Y160","v":0}]
[]
[]
[null,null,null,null,null,null,null,null,null,null,{"$f":"+K160/B130","v":3296800000},{"$f":"+L156/B130","v":0},{"$f":"+L163/200000","v":0},{"$f":"+M163/3800","v":0}]
[]
[]
[]
["Tecnologías recomendadas"]
[1,null,{"$f":"IFERROR(VLOOKUP(A168,$B$156:$C$160,2,FALSE),\"\")","v":"Compostaje en pilas con volteo manual"}]
[2,null,{"$f":"IFERROR(VLOOKUP(A169,$B$156:$C$160,2,FALSE),\"\")","v":"Tratamiento Mecánico Biológico"}]
[3,null,{"$f":"IFERROR(VLOOKUP(A170,$B$156:$C$160,2,FALSE),\"\")","v":"Compostaje en pilas con aireación forzada"}]
[]
[]
[]
[]
[{"$f":"+$C$168","v":"Compostaje en pilas con volteo manual"}]
["Costos de inversión (CAPEX)",null,null,"Costos de operación (OPEX)",null,null,"Ingresos"]
[]
["Fila",{"$f":"+MATCH($C$168,'Costos de inversión'!$A:$A,0)","v":4},null,"Fila",{"$f":"MATCH($C$168,'Costos de operación'!$A:$A,0)","v":4}]
[null,{"$f":"+B178+1","v":5},null,null,{"$f":"+E178+1","v":5}]
[null,{"$f":"+B179+1","v":6},null,null,{"$f":"+E179+1","v":6}]
[null,7,null,null,7]
[null,8,null,null,8]
[null,9,null,null,9]
[null,10,null,null,10]
[null,11,null,null,11]
[null,12,null,null,12]
[null,13,null,null,13]
[null,14]
[null,15]
[null,16]
[null,17]
[null,18]
[null,19]
[null,20]
[null,21]
[null,22]
[null,23]
[]
[]
[null,null,null,null,null,null,"Ingresos por tarifa (COP) (Promedio Anual)",{"$f":"VLOOKUP($A$175,$C$156:$M$160,9,FALSE)/'Datos de entrada'!$B$8","v":3296800000},null,null,null,null,null,null,null,null,null,null,null,null,null,null,null,"Ingresos por tarifa (COP) (Promedio Anual)",{"$f":"+X156/B130","v":0}]
[{"$f":"IF(B178>0,VLOOKUP(B178,'Costos de inversión'!$B$1:$N$382,2,FALSE),\"\")","v":"Pre-inversión"},{"$f":"IF(B178>0,VLOOKUP(B178,'Costos de inversión'!$B$1:$N$382,13,FALSE),\"\")","v":0},null,{"$f":"IF(E178>0,VLOOKUP(E178,'Costos de operación'!$B:$N,2,FALSE),\"\")","v":"Energia"},{"$f":"IF(E178>0,VLOOKUP(E178,'Costos de operación'!$B:$N,13,FALSE),\"\")","v":63000000},null,"Ingresos por comercialización (COP) (Promedio Anual)",{"$f":"VLOOKUP($A$175,$C$156:$M$160,10,FALSE)/'Datos de entrada'!$B$8","v":0},null,null,null,null,null,null,null,null,null,null,null,null,null,null,null,"Ingresos por comercialización (COP) (Promedio Anual)",{"$f":"+Y156/B130","v":0}]
[{"$f":"IF(B179>0,VLOOKUP(B179,'Costos de inversión'!$B$1:$N$382,2,FALSE),\"\")","v":"   Estudios, Diseños "},{"$f":"IF(B179>0,VLOOKUP(B179,'Costos de inversión'!$B$1:$N$382,13,FALSE),\"\")","v":126000000},null,{"$f":"IF(E179>0,VLOOKUP(E179,'Costos de operación'!$B:$N,2,FALSE),\"\")","v":"Combustible"},{"$f":"IF(E179>0,VLOOKUP(E179,'Costos de operación'!$B:$N,13,FALSE),\"\")","v":242000000},null,"Ingresos totales",{"$f":"+H201+H200","v":3296800000},null,null,null,null,null,null,null,null,null,null,null,null,null,null,null,"Ingresos totales",{"$f":"+Y201+Y200","v":0}]
[{"$f":"IF(B180>0,VLOOKUP(B180,'Costos de inversión'!$B$1:$N$382,2,FALSE),\"\")","v":"   Permisos"},{"$f":"IF(B180>0,VLOOKUP(B180,'Costos de inversión'!$B$1:$N$382,13,FALSE),\"\")","v":63000000},null,{"$f":"IF(E180>0,VLOOKUP(E180,'Costos de operación'!$B:$N,2,FALSE),\"\")","v":"Agua "},{"$f":"IF(E180>0,VLOOKUP(E180,'Costos de operación'!$B:$N,13,FALSE),\"\")","v":8000000}]
[{"$f":"IF(B181>0,VLOOKUP(B181,'Costos de inversión'!$B$1:$N$382,2,FALSE),\"\")","v":"Infraestructura"},{"$f":"IF(B181>0,VLOOKUP(B181,'Costos de inversión'!$B$1:$N$382,13,FALSE),\"\")","v":4007000000},null,{"$f":"IF(E181>0,VLOOKUP(E181,'Costos de operación'!$B:$N,2,FALSE),\"\")","v":"Tratamiento RSO"},{"$f":"IF(E181>0,VLOOKUP(E181,'Costos de operación'!$B:$N,13,FALSE),\"\")","v":811000000}]
[{"$f":"IF(B182>0,VLOOKUP(B182,'Costos de inversión'!$B$1:$N$382,2,FALSE),\"\")","v":"Maquinaria y Equipos (incluido el costo de instalación)"},{"$f":"IF(B182>0,VLOOKUP(B182,'Costos de inversión'!$B$1:$N$382,13,FALSE),\"\")","v":0},null,{"$f":"IF(E182>0,VLOOKUP(E182,'Costos de operación'!$B:$N,2,FALSE),\"\")","v":"Monitoreo Ambiental "},{"$f":"IF(E182>0,VLOOKUP(E182,'Costos de operación'!$B:$N,13,FALSE),\"\")","v":4000000}]
[{"$f":"IF(B183>0,VLOOKUP(B183,'Costos de inversión'!$B$1:$N$382,2,FALSE),\"\")","v":"   Trommel"},{"$f":"IF(B183>0,VLOOKUP(B183,'Costos de inversión'!$B$1:$N$382,13,FALSE),\"\")","v":141000000},null,{"$f":"IF(E183>0,VLOOKUP(E183,'Costos de operación'!$B:$N,2,FALSE),\"\")","v":"Mantenimiento - Maquinaria y equipos "},{"$f":"IF(E183>0,VLOOKUP(E183,'Costos de operación'!$B:$N,13,FALSE),\"\")","v":31000000}]
[{"$f":"IF(B184>0,VLOOKUP(B184,'Costos de inversión'!$B$1:$N$382,2,FALSE),\"\")","v":"   Minicargador"},{"$f":"IF(B184>0,VLOOKUP(B184,'Costos de inversión'!$B$1:$N$382,13,FALSE),\"\")","v":244344853},null,{"$f":"IF(E184>0,VLOOKUP(E184,'Costos de operación'!$B:$N,2,FALSE),\"\")","v":"Mantenimiento - Infraestructura "},{"$f":"IF(E184>0,VLOOKUP(E184,'Costos de operación'!$B:$N,13,FALSE),\"\")","v":36000000}]
[{"$f":"IF(B185>0,VLOOKUP(B185,'Costos de inversión'!$B$1:$N$382,2,FALSE),\"\")","v":"   Tractor"},{"$f":"IF(B185>0,VLOOKUP(B185,'Costos de inversión'!$B$1:$N$382,13,FALSE),\"\")","v":244344853},null,{"$f":"IF(E185>0,VLOOKUP(E185,'Costos de operación'!$B:$N,2,FALSE),\"\")","v":"Mano de Obra"},{"$f":"IF(E185>0,VLOOKUP(E185,'Costos de operación'!$B:$N,13,FALSE),\"\")","v":57000000}]
[{"$f":"IF(B186>0,VLOOKUP(B186,'Costos de inversión'!$B$1:$N$382,2,FALSE),\"\")","v":"   Retroexcavadora"},{"$f":"IF(B186>0,VLOOKUP(B186,'Costos de inversión'!$B$1:$N$382,13,FALSE),\"\")","v":212985085},null,{"$f":"IF(E186>0,VLOOKUP(E186,'Costos de operación'!$B:$N,2,FALSE),\"\")","v":"Valor de Operación Anual"},{"$f":"IF(E186>0,VLOOKUP(E186,'Costos de operación'!$B:$N,13,FALSE),\"\")","v":1252000000}]
[{"$f":"IF(B187>0,VLOOKUP(B187,'Costos de inversión'!$B$1:$N$382,2,FALSE),\"\")","v":"   Montacargas"},{"$f":"IF(B187>0,VLOOKUP(B187,'Costos de inversión'!$B$1:$N$382,13,FALSE),\"\")","v":151572208},null,{"$f":"IF(E187>0,VLOOKUP(E187,'Costos de operación'!$B:$N,2,FALSE),\"\")","v":0},{"$f":"IF(E187>0,VLOOKUP(E187,'Costos de operación'!$B:$N,13,FALSE),\"\")","v":0}]
[{"$f":"IF(B188>0,VLOOKUP(B188,'Costos de inversión'!$B$1:$N$382,2,FALSE),\"\")","v":"   Planta electrica"},{"$f":"IF(B188>0,VLOOKUP(B188,'Costos de inversión'!$B$1:$N$382,13,FALSE),\"\")","v":143732266},null,{"$f":"IF(E188>0,VLOOKUP(E188,'Costos de operación'!$B:$N,2,FALSE),\"\")","v":""},{"$f":"IF(E188>0,VLOOKUP(E188,'Costos de operación'!$B:$N,13,FALSE),\"\")","v":""}]
[{"$f":"IF(B189>0,VLOOKUP(B189,'Costos de inversión'!$B$1:$N$382,2,FALSE),\"\")","v":"   Compresor"},{"$f":"IF(B189>0,VLOOKUP(B189,'Costos de inversión'!$B$1:$N$382,13,FALSE),\"\")","v":35279738},null,{"$f":"IF(E189>0,VLOOKUP(E189,'Costos de operación'!$B:$N,2,FALSE),\"\")","v":""},{"$f":"IF(E189>0,VLOOKUP(E189,'Costos de operación'!$B:$N,13,FALSE),\"\")","v":""}]
[{"$f":"IF(B190>0,VLOOKUP(B190,'Costos de inversión'!$B$1:$N$382,2,FALSE),\"\")","v":"   Volqueta"},{"$f":"IF(B190>0,VLOOKUP(B190,'Costos de inversión'!$B$1:$N$382,13,FALSE),\"\")","v":574929065},null,null,{"$f":"IF(E190>0,VLOOKUP(E190,'Costos de operación'!$B:$N,13,FALSE),\"\")","v":""}]
[{"$f":"IF(B191>0,VLOOKUP(B191,'Costos de inversión'!$B$1:$N$382,2,FALSE),\"\")","v":"Total Costo de Inversión Inicial"},{"$f":"IF(B191>0,VLOOKUP(B191,'Costos de inversión'!$B$1:$N$382,13,FALSE),\"\")","v":5944188068},null,{"$f":"IF(E191>0,VLOOKUP(E191,'Costos de operación'!$B:$N,2,FALSE),\"\")","v":""},{"$f":"IF(E191>0,VLOOKUP(E191,'Costos de operación'!$B:$N,13,FALSE),\"\")","v":""}]
[{"$f":"IF(B192>0,VLOOKUP(B192,'Costos de inversión'!$B$1:$N$382,2,FALSE),\"\")","v":0},{"$f":"IF(B192>0,VLOOKUP(B192,'Costos de inversión'!$B$1:$N$382,13,FALSE),\"\")","v":0}]
[{"$f":"IF(B193>0,VLOOKUP(B193,'Costos de inversión'!$B$1:$N$382,2,FALSE),\"\")","v":0},{"$f":"IF(B193>0,VLOOKUP(B193,'Costos de inversión'!$B$1:$N$382,13,FALSE),\"\")","v":0}]
[]
[]
[]
[]
[]
[{"$f":"+$C$169","v":"Tratamiento Mecánico Biológico"}]
["Costos de inversión (CAPEX)",null,null,"Costos de operación (OPEX)",null,null,"Ingresos"]
[]
["Fila",{"$f":"+MATCH($C$169,'Costos de inversión'!$A:$A,0)","v":63},null,"Fila",{"$f":"MATCH($C$169,'Costos de operación'!$A:$A,0)","v":49}]
[null,{"$f":"+B225+1","v":64},null,null,{"$f":"+E225+1","v":50}]
[null,{"$f":"+B226+1","v":65},null,null,{"$f":"+E226+1","v":51}]
[null,66,null,null,52]
[null,67,null,null,53]
[null,68,null,null,54]
[null,69,null,null,55]
[null,70,null,null,56]
[null,71,null,null,57]
[null,72,null,null,58]
[null,73]
[null,74]
[null,75]
[null,76]
[null,77]
[null,78]
[null,79]
[null,80]
[null,81]
[null,82]
[]
[]
[null,null,null,null,null,null,{"$f":"+G200","v":"Ingresos por tarifa (COP) (Promedio Anual)"},{"$f":"VLOOKUP($A$222,$C$156:$M$160,9,FALSE)/'Datos de entrada'!B8","v":3296800000}]
[{"$f":"IF(B225>0,VLOOKUP(B225,'Costos de inversión'!$B$1:$N$382,2,FALSE),\"\")","v":"Pre-inversión"},{"$f":"IF(B225>0,VLOOKUP(B225,'Costos de inversión'!$B$1:$N$382,13,FALSE),\"\")","v":0},null,{"$f":"IF(E225>0,VLOOKUP(E225,'Costos de operación'!$B:$N,2,FALSE),\"\")","v":"Disposición final de rechazos diferentes a residuos que van a otro tratamiento"},{"$f":"IF(E225>0,VLOOKUP(E225,'Costos de operación'!$B:$N,13,FALSE),\"\")","v":3560000000},null,{"$f":"+G201","v":"Ingresos por comercialización (COP) (Promedio Anual)"},{"$f":"VLOOKUP($A$222,$C$156:$M$160,10,FALSE)/'Datos de entrada'!B8","v":0}]
[{"$f":"IF(B226>0,VLOOKUP(B226,'Costos de inversión'!$B$1:$N$382,2,FALSE),\"\")","v":"   Estudios, Diseños "},{"$f":"IF(B226>0,VLOOKUP(B226,'Costos de inversión'!$B$1:$N$382,13,FALSE),\"\")","v":121000000},null,{"$f":"IF(E226>0,VLOOKUP(E226,'Costos de operación'!$B:$N,2,FALSE),\"\")","v":"Tratamiento RSO (compostaje aireación forzada)"},{"$f":"IF(E226>0,VLOOKUP(E226,'Costos de operación'!$B:$N,13,FALSE),\"\")","v":868000000},null,"Ingresos totales",{"$f":"+H248+H247","v":3296800000}]
[{"$f":"IF(B227>0,VLOOKUP(B227,'Costos de inversión'!$B$1:$N$382,2,FALSE),\"\")","v":"   Permisos"},{"$f":"IF(B227>0,VLOOKUP(B227,'Costos de inversión'!$B$1:$N$382,13,FALSE),\"\")","v":81000000},null,{"$f":"IF(E227>0,VLOOKUP(E227,'Costos de operación'!$B:$N,2,FALSE),\"\")","v":"Combustible"},{"$f":"IF(E227>0,VLOOKUP(E227,'Costos de operación'!$B:$N,13,FALSE),\"\")","v":108000000}]
[{"$f":"IF(B228>0,VLOOKUP(B228,'Costos de inversión'!$B$1:$N$382,2,FALSE),\"\")","v":"Infraestructura"},{"$f":"IF(B228>0,VLOOKUP(B228,'Costos de inversión'!$B$1:$N$382,13,FALSE),\"\")","v":811000000},null,{"$f":"IF(E228>0,VLOOKUP(E228,'Costos de operación'!$B:$N,2,FALSE),\"\")","v":"Energía (consumo)"},{"$f":"IF(E228>0,VLOOKUP(E228,'Costos de operación'!$B:$N,13,FALSE),\"\")","v":299000000}]
[{"$f":"IF(B229>0,VLOOKUP(B229,'Costos de inversión'!$B$1:$N$382,2,FALSE),\"\")","v":"Maquinaria y Equipos (incluido el costo de instalación)"},{"$f":"IF(B229>0,VLOOKUP(B229,'Costos de inversión'!$B$1:$N$382,13,FALSE),\"\")","v":0},null,{"$f":"IF(E229>0,VLOOKUP(E229,'Costos de operación'!$B:$N,2,FALSE),\"\")","v":"Monitoreo Ambiental"},{"$f":"IF(E229>0,VLOOKUP(E229,'Costos de operación'!$B:$N,13,FALSE),\"\")","v":4000000}]
[{"$f":"IF(B230>0,VLOOKUP(B230,'Costos de inversión'!$B$1:$N$382,2,FALSE),\"\")","v":"   Bandas transportadoras"},{"$f":"IF(B230>0,VLOOKUP(B230,'Costos de inversión'!$B$1:$N$382,13,FALSE),\"\")","v":277000000},null,{"$f":"IF(E230>0,VLOOKUP(E230,'Costos de operación'!$B:$N,2,FALSE),\"\")","v":"Mantenimiento - Maquinaria y equipos "},{"$f":"IF(E230>0,VLOOKUP(E230,'Costos de operación'!$B:$N,13,FALSE),\"\")","v":30000000}]
[{"$f":"IF(B231>0,VLOOKUP(B231,'Costos de inversión'!$B$1:$N$382,2,FALSE),\"\")","v":"   Sistema de tamizaje (piso vivo, tolva viva, bandas y tromel)"},{"$f":"IF(B231>0,VLOOKUP(B231,'Costos de inversión'!$B$1:$N$382,13,FALSE),\"\")","v":185000000},null,{"$f":"IF(E231>0,VLOOKUP(E231,'Costos de operación'!$B:$N,2,FALSE),\"\")","v":"Mantenimiento - Infraestructura "},{"$f":"IF(E231>0,VLOOKUP(E231,'Costos de operación'!$B:$N,13,FALSE),\"\")","v":10000000}]
[{"$f":"IF(B232>0,VLOOKUP(B232,'Costos de inversión'!$B$1:$N$382,2,FALSE),\"\")","v":"   Imán de remoción de metales"},{"$f":"IF(B232>0,VLOOKUP(B232,'Costos de inversión'!$B$1:$N$382,13,FALSE),\"\")","v":87883396},null,{"$f":"IF(E232>0,VLOOKUP(E232,'Costos de operación'!$B:$N,2,FALSE),\"\")","v":"Mano de Obra"},{"$f":"IF(E232>0,VLOOKUP(E232,'Costos de operación'!$B:$N,13,FALSE),\"\")","v":227000000}]
[{"$f":"IF(B233>0,VLOOKUP(B233,'Costos de inversión'!$B$1:$N$382,2,FALSE),\"\")","v":"   Sistema separación balística "},{"$f":"IF(B233>0,VLOOKUP(B233,'Costos de inversión'!$B$1:$N$382,13,FALSE),\"\")","v":461000000},null,{"$f":"IF(E233>0,VLOOKUP(E233,'Costos de operación'!$B:$N,2,FALSE),\"\")","v":"Valor de Operación Anual"},{"$f":"IF(E233>0,VLOOKUP(E233,'Costos de operación'!$B:$N,13,FALSE),\"\")","v":4879000000}]
[{"$f":"IF(B234>0,VLOOKUP(B234,'Costos de inversión'!$B$1:$N$382,2,FALSE),\"\")","v":"   Rompebolsas"},{"$f":"IF(B234>0,VLOOKUP(B234,'Costos de inversión'!$B$1:$N$382,13,FALSE),\"\")","v":554000000},null,{"$f":"IF(E234>0,VLOOKUP(E234,'Costos de operación'!$B:$N,2,FALSE),\"\")","v":0},{"$f":"IF(E234>0,VLOOKUP(E234,'Costos de operación'!$B:$N,13,FALSE),\"\")","v":0}]
[{"$f":"IF(B235>0,VLOOKUP(B235,'Costos de inversión'!$B$1:$N$382,2,FALSE),\"\")","v":"   Báscula de pesaje"},{"$f":"IF(B235>0,VLOOKUP(B235,'Costos de inversión'!$B$1:$N$382,13,FALSE),\"\")","v":206314606},null,{"$f":"IF(E235>0,VLOOKUP(E235,'Costos de operación'!$B:$N,2,FALSE),\"\")","v":""},{"$f":"IF(E235>0,VLOOKUP(E235,'Costos de operación'!$B:$N,13,FALSE),\"\")","v":""}]
[{"$f":"IF(B236>0,VLOOKUP(B236,'Costos de inversión'!$B$1:$N$382,2,FALSE),\"\")","v":"Sistema de compostaje (Compostaje en pilas con aireación forzada)"},{"$f":"IF(B236>0,VLOOKUP(B236,'Costos de inversión'!$B$1:$N$382,13,FALSE),\"\")","v":4074000000},null,{"$f":"IF(E236>0,VLOOKUP(E236,'Costos de operación'!$B:$N,2,FALSE),\"\")","v":""},{"$f":"IF(E236>0,VLOOKUP(E236,'Costos de operación'!$B:$N,13,FALSE),\"\")","v":""}]
[{"$f":"IF(B237>0,VLOOKUP(B237,'Costos de inversión'!$B$1:$N$382,2,FALSE),\"\")","v":"Total Costo de Inversión Inicial"},{"$f":"IF(B237>0,VLOOKUP(B237,'Costos de inversión'!$B$1:$N$382,13,FALSE),\"\")","v":6858198002},null,{"$f":"IF(E237>0,VLOOKUP(E237,'Costos de operación'!$B:$N,2,FALSE),\"\")","v":""},{"$f":"IF(E237>0,VLOOKUP(E237,'Costos de operación'!$B:$N,13,FALSE),\"\")","v":""}]
[{"$f":"IF(B238>0,VLOOKUP(B238,'Costos de inversión'!$B$1:$N$382,2,FALSE),\"\")","v":0},{"$f":"IF(B238>0,VLOOKUP(B238,'Costos de inversión'!$B$1:$N$382,13,FALSE),\"\")","v":0},null,{"$f":"IF(E238>0,VLOOKUP(E238,'Costos de operación'!$B:$N,2,FALSE),\"\")","v":""},{"$f":"IF(E238>0,VLOOKUP(E238,'Costos de operación'!$B:$N,13,FALSE),\"\")","v":""}]
[{"$f":"IF(B239>0,VLOOKUP(B239,'Costos de inversión'!$B$1:$N$382,2,FALSE),\"\")","v":0},{"$f":"IF(B239>0,VLOOKUP(B239,'Costos de inversión'!$B$1:$N$382,13,FALSE),\"\")","v":0}]
[{"$f":"IF(B240>0,VLOOKUP(B240,'Costos de inversión'!$B$1:$N$382,2,FALSE),\"\")","v":0},{"$f":"IF(B240>0,VLOOKUP(B240,'Costos de inversión'!$B$1:$N$382,13,FALSE),\"\")","v":0}]
[]
[]
[]
[]
[]
[{"$f":"+$C$170","v":"Compostaje en pilas con aireación forzada"}]
["Costos de inversión (CAPEX)",null,null,"Costos de operación (OPEX)",null,null,"Ingresos"]
[]
["Fila",{"$f":"+MATCH($C$170,'Costos de inversión'!$A:$A,0)","v":24},null,"Fila",{"$f":"MATCH($C$170,'Costos de operación'!$A:$A,0)","v":19}]
[null,{"$f":"+B272+1","v":25},null,null,{"$f":"+E272+1","v":20}]
[null,{"$f":"+B273+1","v":26},null,null,{"$f":"+E273+1","v":21}]
[null,27,null,null,22]
[null,28,null,null,23]
[null,29,null,null,24]
[null,30,null,null,25]
[null,31,null,null,26]
[null,32,null,null,27]
[null,33,null,null,28]
[null,34]
[null,35]
[null,36]
[null,37]
[null,38]
[null,39]
[null,40]
[null,41]
[null,42]
[null,43]
[]
[]
[null,null,null,null,null,null,{"$f":"+G247","v":"Ingresos por tarifa (COP) (Promedio Anual)"},{"$f":"VLOOKUP($A$269,$C$156:$M$160,9,FALSE)/'Datos de entrada'!B8","v":3296800000}]
[{"$f":"IF(B272>0,VLOOKUP(B272,'Costos de inversión'!$B$1:$N$382,2,FALSE),\"\")","v":"Pre-inversión"},{"$f":"IF(B272>0,VLOOKUP(B272,'Costos de inversión'!$B$1:$N$382,13,FALSE),\"\")","v":0},null,{"$f":"IF(E272>0,VLOOKUP(E272,'Costos de operación'!$B:$N,2,FALSE),\"\")","v":"Energia"},{"$f":"IF(E272>0,VLOOKUP(E272,'Costos de operación'!$B:$N,13,FALSE),\"\")","v":67000000},null,{"$f":"+G248","v":"Ingresos por comercialización (COP) (Promedio Anual)"},{"$f":"VLOOKUP($A$269,$C$156:$M$160,10,FALSE)/'Datos de entrada'!B8","v":0}]
[{"$f":"IF(B273>0,VLOOKUP(B273,'Costos de inversión'!$B$1:$N$382,2,FALSE),\"\")","v":"   Estudios, Diseños "},{"$f":"IF(B273>0,VLOOKUP(B273,'Costos de inversión'!$B$1:$N$382,13,FALSE),\"\")","v":264000000},null,{"$f":"IF(E273>0,VLOOKUP(E273,'Costos de operación'!$B:$N,2,FALSE),\"\")","v":"Combustible"},{"$f":"IF(E273>0,VLOOKUP(E273,'Costos de operación'!$B:$N,13,FALSE),\"\")","v":259000000},null,"Ingresos totales",{"$f":"+H295+H294","v":3296800000}]
[{"$f":"IF(B274>0,VLOOKUP(B274,'Costos de inversión'!$B$1:$N$382,2,FALSE),\"\")","v":"   Permisos"},{"$f":"IF(B274>0,VLOOKUP(B274,'Costos de inversión'!$B$1:$N$382,13,FALSE),\"\")","v":72000000},null,{"$f":"IF(E274>0,VLOOKUP(E274,'Costos de operación'!$B:$N,2,FALSE),\"\")","v":"Agua "},{"$f":"IF(E274>0,VLOOKUP(E274,'Costos de operación'!$B:$N,13,FALSE),\"\")","v":8000000}]
[{"$f":"IF(B275>0,VLOOKUP(B275,'Costos de inversión'!$B$1:$N$382,2,FALSE),\"\")","v":"Infraestructura"},{"$f":"IF(B275>0,VLOOKUP(B275,'Costos de inversión'!$B$1:$N$382,13,FALSE),\"\")","v":4288000000},null,{"$f":"IF(E275>0,VLOOKUP(E275,'Costos de operación'!$B:$N,2,FALSE),\"\")","v":"Tratamiento RSO"},{"$f":"IF(E275>0,VLOOKUP(E275,'Costos de operación'!$B:$N,13,FALSE),\"\")","v":868000000}]
[{"$f":"IF(B276>0,VLOOKUP(B276,'Costos de inversión'!$B$1:$N$382,2,FALSE),\"\")","v":"Maquinaria y Equipos (incluido el costo de instalación)"},{"$f":"IF(B276>0,VLOOKUP(B276,'Costos de inversión'!$B$1:$N$382,13,FALSE),\"\")","v":0},null,{"$f":"IF(E276>0,VLOOKUP(E276,'Costos de operación'!$B:$N,2,FALSE),\"\")","v":"Monitoreo Ambiental "},{"$f":"IF(E276>0,VLOOKUP(E276,'Costos de operación'!$B:$N,13,FALSE),\"\")","v":4000000}]
[{"$f":"IF(B277>0,VLOOKUP(B277,'Costos de inversión'!$B$1:$N$382,2,FALSE),\"\")","v":"   Trommel"},{"$f":"IF(B277>0,VLOOKUP(B277,'Costos de inversión'!$B$1:$N$382,13,FALSE),\"\")","v":151000000},null,{"$f":"IF(E277>0,VLOOKUP(E277,'Costos de operación'!$B:$N,2,FALSE),\"\")","v":"Mantenimiento - Maquinaria y equipos "},{"$f":"IF(E277>0,VLOOKUP(E277,'Costos de operación'!$B:$N,13,FALSE),\"\")","v":33000000}]
[{"$f":"IF(B278>0,VLOOKUP(B278,'Costos de inversión'!$B$1:$N$382,2,FALSE),\"\")","v":"   Minicargador"},{"$f":"IF(B278>0,VLOOKUP(B278,'Costos de inversión'!$B$1:$N$382,13,FALSE),\"\")","v":261448992},null,{"$f":"IF(E278>0,VLOOKUP(E278,'Costos de operación'!$B:$N,2,FALSE),\"\")","v":"Mantenimiento - Infraestructura "},{"$f":"IF(E278>0,VLOOKUP(E278,'Costos de operación'!$B:$N,13,FALSE),\"\")","v":54000000}]
[{"$f":"IF(B279>0,VLOOKUP(B279,'Costos de inversión'!$B$1:$N$382,2,FALSE),\"\")","v":"   Tractor"},{"$f":"IF(B279>0,VLOOKUP(B279,'Costos de inversión'!$B$1:$N$382,13,FALSE),\"\")","v":261448992},null,{"$f":"IF(E279>0,VLOOKUP(E279,'Costos de operación'!$B:$N,2,FALSE),\"\")","v":"Mano de Obra"},{"$f":"IF(E279>0,VLOOKUP(E279,'Costos de operación'!$B:$N,13,FALSE),\"\")","v":57000000}]
[{"$f":"IF(B280>0,VLOOKUP(B280,'Costos de inversión'!$B$1:$N$382,2,FALSE),\"\")","v":"   Retroexcavadora"},{"$f":"IF(B280>0,VLOOKUP(B280,'Costos de inversión'!$B$1:$N$382,13,FALSE),\"\")","v":227894041},null,{"$f":"IF(E280>0,VLOOKUP(E280,'Costos de operación'!$B:$N,2,FALSE),\"\")","v":"Valor de Operación Anual"},{"$f":"IF(E280>0,VLOOKUP(E280,'Costos de operación'!$B:$N,13,FALSE),\"\")","v":1350000000}]
[{"$f":"IF(B281>0,VLOOKUP(B281,'Costos de inversión'!$B$1:$N$382,2,FALSE),\"\")","v":"   Montacargas"},{"$f":"IF(B281>0,VLOOKUP(B281,'Costos de inversión'!$B$1:$N$382,13,FALSE),\"\")","v":162182263},null,{"$f":"IF(E281>0,VLOOKUP(E281,'Costos de operación'!$B:$N,2,FALSE),\"\")","v":0},{"$f":"IF(E281>0,VLOOKUP(E281,'Costos de operación'!$B:$N,13,FALSE),\"\")","v":0}]
[{"$f":"IF(B282>0,VLOOKUP(B282,'Costos de inversión'!$B$1:$N$382,2,FALSE),\"\")","v":"   Planta electrica"},{"$f":"IF(B282>0,VLOOKUP(B282,'Costos de inversión'!$B$1:$N$382,13,FALSE),\"\")","v":307587050},null,{"$f":"IF(E282>0,VLOOKUP(E282,'Costos de operación'!$B:$N,2,FALSE),\"\")","v":""},{"$f":"IF(E282>0,VLOOKUP(E282,'Costos de operación'!$B:$N,13,FALSE),\"\")","v":""}]
[{"$f":"IF(B283>0,VLOOKUP(B283,'Costos de inversión'!$B$1:$N$382,2,FALSE),\"\")","v":"   Compresor"},{"$f":"IF(B283>0,VLOOKUP(B283,'Costos de inversión'!$B$1:$N$382,13,FALSE),\"\")","v":75498640},null,{"$f":"IF(E283>0,VLOOKUP(E283,'Costos de operación'!$B:$N,2,FALSE),\"\")","v":""},{"$f":"IF(E283>0,VLOOKUP(E283,'Costos de operación'!$B:$N,13,FALSE),\"\")","v":""}]
[{"$f":"IF(B284>0,VLOOKUP(B284,'Costos de inversión'!$B$1:$N$382,2,FALSE),\"\")","v":"   Volqueta"},{"$f":"IF(B284>0,VLOOKUP(B284,'Costos de inversión'!$B$1:$N$382,13,FALSE),\"\")","v":615174100},null,{"$f":"IF(E284>0,VLOOKUP(E284,'Costos de operación'!$B:$N,2,FALSE),\"\")","v":""},{"$f":"IF(E284>0,VLOOKUP(E284,'Costos de operación'!$B:$N,13,FALSE),\"\")","v":""}]
[{"$f":"IF(B285>0,VLOOKUP(B285,'Costos de inversión'!$B$1:$N$382,2,FALSE),\"\")","v":"   Báscula de pesaje"},{"$f":"IF(B285>0,VLOOKUP(B285,'Costos de inversión'!$B$1:$N$382,13,FALSE),\"\")","v":103157303},null,{"$f":"IF(E285>0,VLOOKUP(E285,'Costos de operación'!$B:$N,2,FALSE),\"\")","v":""},{"$f":"IF(E285>0,VLOOKUP(E285,'Costos de operación'!$B:$N,13,FALSE),\"\")","v":""}]
[{"$f":"IF(B286>0,VLOOKUP(B286,'Costos de inversión'!$B$1:$N$382,2,FALSE),\"\")","v":"Total Costo de Inversión Inicial"},{"$f":"IF(B286>0,VLOOKUP(B286,'Costos de inversión'!$B$1:$N$382,13,FALSE),\"\")","v":6789391381}]
[{"$f":"IF(B287>0,VLOOKUP(B287,'Costos de inversión'!$B$1:$N$382,2,FALSE),\"\")","v":0},{"$f":"IF(B287>0,VLOOKUP(B287,'Costos de inversión'!$B$1:$N$382,13,FALSE),\"\")","v":0}]
[]
[]
[]
[]
[]
[]
[]
[]
[]
["Condicional para listas de entrada de datos"]
[{"$f":"+'Datos de entrada'!A11","v":"Tratamiento de residuos orgánicos provenientes de plazas de mercado y centrales de abasto no incluidos anteriormente"},{"$f":"+IF('Datos de entrada'!B11=\"Si\",0,\"No\")","v":"No"}]
[{"$f":"+'Datos de entrada'!A13","v":"Tratamiento de residuos orgánicos provenientes de las actividades de poda de árboles y corte de césped no incluidos anteriormente"},{"$f":"+IF('Datos de entrada'!B13=\"Si\",0,\"No\")","v":"No"}]
[{"$f":"+'Datos de entrada'!A6","v":"Proyecto Regional"},{"$f":"+IF('Datos de entrada'!B6=\"Si\",0,\"No\")","v":0}]

{"sheet":"Ponderaciones","index":7,"n_rows":203,"n_cols":8,"rows_kept":203,"cut":false,"hidden":true,"merged":[[187,3,187,4],[187,6,187,7],[96,0,96,1],[130,0,130,1],[91,0,91,1],[91,3,91,4],[91,6,91,7],[118,1,118,2],[103,1,103,2],[105,1,105,2],[109,0,109,1],[46,3,46,4],[46,6,46,7],[57,1,57,2],[59,1,59,2],[196,0,196,1],[196,3,196,4],[196,6,196,7],[120,1,120,2],[124,0,124,1],[124,3,124,4],[124,6,124,7],[143,3,143,5],[143,6,144,6],[178,1,178,2],[180,1,180,2],[187,0,187,1],[84,1,84,2],[86,1,86,2],[9,6,9,7],[22,1,22,2],[41,1,41,2],[29,0,29,1],[29,3,29,4],[29,6,29,7],[39,1,39,2],[15,6,15,7],[65,0,65,1],[65,3,65,4],[65,6,65,7],[74,0,74,1],[74,3,74,4],[46,0,46,1],[2,1,2,2],[4,1,4,2],[9,0,9,1],[9,3,9,4],[24,1,24,2]]}
["Capacidad Administrativa"]
[]
["Ponderación","Valor",null,null,"Indicador","Peso ponderación"]
["Alta",">=",8,null,"Medición de Desempeño Municipal",0.5]
["Media","4<n<8",null,null,"Categoría Municipal (Ley 617 de 2000)",0.125]
["Baja","<",4,null,"Municipio PDET o ZOMAC",0.125]
[null,null,null,null,"Existencia de PGIRS actualizado",0.25]
[]
[]
["Medición de Desempeño Municipal",null,null,"Categoría Municipal (Ley 617 de 2000)",null,null,"Municipio PDET o ZOMAC"]
["Resultado","Valor",null,"Resultado","Valor",null,"Resultado","Valor"]
["Bajo",2,null,"Sexta",1,null,"Si",1]
["Crítico",4,null,"Quinta",2,null,"No",10]
["Medio",6,null,"Cuarta",4]
["Satisfactorio",8,null,"Tercera",6]
["Sobresaliente",10,null,"Segunda",8,null,"Existencia de PGIRS actualizado"]
[null,null,null,"Primera",10,null,"Resultado","Valor"]
[null,null,null,"Especial",10,null,"Si",10]
[null,null,null,null,null,null,"No",1]
[]
["Capacidad Técnica - Separación en la fuente"]
[]
["Ponderación","Valor",null,null,"Indicador","Peso ponderación"]
["Alta",">=",8,null,"¿Existen rutas selectivas de residuos aprovechables?",0.4]
["Media","4<n<8",null,null,"¿Separan los residuos orgánicos?",0.2]
["Baja","<",4,null,{"$f":"G30","v":"Línea base PGIRS actualizada"},0.4]
[]
[]
[]
["¿Existen rutas selectivas de residuos aprovechables?",null,null,"¿Separan los residuos orgánicos?",null,null,"Línea base PGIRS actualizada"]
["Resultado","Valor",null,"Resultado","Valor",null,"Resultado","Valor"]
["No",1,null,"No",1,null,"No",1]
["Si",10,null,"Si",10,null,"Si",10]
[]
[]
[]
[]
["Capacidad Técnica - Recolección y Transporte"]
[]
["Ponderación","Valor",null,null,"Indicador","Peso ponderación"]
["Alta",">=",8,null,"Cobertura en la recolección y transporte de residuos en el área urbana (%)",0.4]
["Media","4<n<8",null,null,"Cobertura en la recolección y transporte de residuos en el área rural (%)",0.3]
["Baja","<",4,null,"Distancia a sitio de disposición final",0.15]
[null,null,null,null,"Estado de las vías hasta el sitio de disposición final más cercano o utilizado actualmente",0.15]
[]
[]
["Cobertura en la recolección y transporte de residuos",null,null,"Distancia a sitio de disposición final",null,null,"Distancia a sitio de disposición final"]
["Resultado","Valor",null,"Resultado","Valor",null,"Resultado","Valor"]
["Menor al 50%",3,null,"Menor a 10 km",10,null,"Inexistentes o distintas a vía terreste",10]
["Entre el 50% y el 75%",6,null,"Entre 10 km y 20 km",8,null,"Tramo mayoritariamente despavimentado, difícil acceso",4]
["Entre el 75% y el 90%",8,null,"Entre 20 km y 50 km",6,null,"Tramo mayoritariamente despavimentado, fácil acceso",6]
["Superior al 90%",10,null,"Entre 50 km y 100 km",4,null,"Tramo mayoritariamente pavimentado, difícil acceso",8]
[null,null,null,"Más de 100 km",2,null,"Tramo mayoritariamente pavimentado, fácil acceso",10]
[]
[]
["Capacidad Técnica - Tratamiento y Disposición final"]
[]
["Ponderación","Valor",null,null,"Indicador","Peso ponderación"]
["Alta",">=",8,null,"Tipo de sitio de disposición final",0.5]
["Media","4<n<8",null,null,"El sitio de disposición final, ¿es regional?",0.1]
["Baja","<",4,null,"Años de operación del sitio de disposición final",0.1]
[null,null,null,null,"Vida útil del sitio de disposición final",0.1]
[null,null,null,null,"Sistema de extracción y aprovechamiento de biogás en el sitio de disposición final",0.2]
[]
[]
["Tipo de sitio de disposición final",null,null,"El sitio de disposición final, ¿es regional?",null,null,"Años de operación del sitio de disposición final"]
["Resultado","Valor",null,"Resultado","Valor",null,"Resultado","Valor"]
["Relleno Sanitario",10,null,"No",1,null,"Menos de 5 años",2]
["Celda de contingencia",7,null,"Si",10,null,"Entre 5 y 10 años ",4]
["Celda transitoria",5,null,null,null,null,"Entre 10 y 15 años",6]
["Botadero a cielo abierto",3,null,null,null,null,"Entre 15 y 20 años",8]
["Otro",1,null,null,null,null,"Más de 20 años",10]
[]
[]
["Vida útil del sitio de disposición final",null,null,"Sistema de extracción y aprovechamiento de biogás en el sitio de disposición final"]
["Resultado","Valor",null,"Resultado","Valor"]
["Menos de 5 años",2,null,"No cuenta con sistema de extracción del biogás",1]
["Entre 5 y 10 años ",4,null,"Cuenta con sistema de extracción más no de aprovechamiento",5]
["Entre 10 y 15 años",6,null,"Cuenta con sistema de extracción y de aprovechamiento",10]
["Entre 15 y 20 años",8]
["Más de 20 años",10]
[]
["Capacidad Técnica - Uso de suelo"]
[]
["Ponderación","Valor",null,null,"Indicador","Peso ponderación"]
["Alta",">=",8,null,"Existencia de polígonos para la edificación de infraestructura de tratamiento en el Plan de Ordenamiento Territorial municipal",0.7]
["Media","4<n<8",null,null,"Existencia de áreas ya impactadas por las actividades de disposición final y transferencia",0.1]
["Baja","<",4,null,"Existencia de suelos urbanos con actividades definidas como industriales de alto impacto",0.1]
[null,null,null,null,"Existencia de suelos de expansión y rurales sin restricciones ambientales y debidamente recogidas en la cartografía oficial",0.1]
[]
[]
["Existencia de polígonos para la edificación de infraestructura de tratamiento en el Plan de Ordenamiento Territorial municipal",null,null,"Existencia de áreas ya impactadas por las actividades de disposición final y transferencia",null,null,"Existencia de suelos urbanos con actividades definidas como industriales de alto impacto"]
["Resultado","Valor",null,"Resultado","Valor",null,"Resultado","Valor"]
["No",1,null,"No",1,null,"No",1]
["Si",10,null,"Si",10,null,"Si",10]
[]
["Existencia de suelos de expansión y rurales sin restricciones ambientales y debidamente recogidas en la cartografía oficial"]
["Resultado","Valor"]
["No",1]
["Si",10]
[]
["Capacidad Técnica - Ponderación total"]
[]
["Ponderación","Valor",null,null,"Indicador","Peso ponderación"]
["Alta",">=",8,null,"Separación en la fuente",0.15]
["Media","4<n<8",null,null,"Recolección y transporte",0.2]
["Baja","<",4,null,"Tratamiento y Disposición Final",0.25]
[null,null,null,null,"Uso de suelo",0.4]
[]
["Resultados indicador"]
["Resultado","Valor"]
["Alta",10]
["Media",5]
["Baja",1]
[]
[]
["Capacidad Económica"]
[]
["Ponderación","Valor",null,null,"Indicador","Peso ponderación"]
["Alta",">=",8,null,"Existen proyectos de tratamiento de residuos sólidos viabilizados en el PGIRS",0.25]
["Media","4<n<8",null,null,"Recursos del FUT destinados por la entidad territorial para financiar el tratamiento de residuos sólidos",0.15]
["Baja","<",4,null,"Índice de pobreza multidimensional",0.4]
[null,null,null,null,"Eficiencia en el recaudo",0.2]
[]
["Existen proyectos de tratamiento de residuos sólidos viabilizados en el PGIRS",null,null,"Recursos del FUT destinados por la entidad territorial para financiar el tratamiento de residuos sólidos",null,null,"Índice de Pobreza Multidimensional"]
["Resultado","Valor",null,"Resultado","Valor",null,"Resultado","Valor"]
["No",1,null,"No",1,null,"Menor al 10%",10]
["Si",10,null,"Si",10,null,"Entre el 10% y el 25%",8]
[null,null,null,null,null,null,"Entre el 25% y el 50%",6]
[null,null,null,null,null,null,"Entre el 50% y el 75%",4]
["Eficiencia en el recaudo",null,null,null,null,null,"Superior al 75%",2]
["Resultado","Valor"]
["Menor al 10%",2]
["Entre el 10% y el 25%",4]
["Entre el 25% y el 50%",6]
["Entre el 50% y el 75%",8]
["Superior al 75%",10]
[]
[]
["Identificación Escenarios"]
[]
[]
[]
["Escenario","Nivel de favorabilidad",null,"Aspecto",null,null,"Escenario"]
[1,"Muy alta",null,"Capacidad Administrativa","Capacidad técnica","Capacidad económica"]
[2,"Alta",null,"Alta","Alta","Alta",1]
[3,"Media",null,"Media","Alta","Alta",2]
[4,"Moderada",null,"Alta","Alta","Media",2]
[5,"Baja",null,"Media","Alta","Media",2]
[6,"Muy baja",null,"Alta","Alta","Baja",2]
[null,null,null,"Baja","Alta","Alta",2]
[null,null,null,"Media","Alta","Baja",3]
[null,null,null,"Baja","Alta","Media",3]
[null,null,null,"Alta","Media","Alta",3]
[null,null,null,"Alta","Media","Media",3]
[null,null,null,"Media","Media","Alta",3]
[null,null,null,"Media","Media","Media",3]
[null,null,null,"Baja","Alta","Baja",4]
[null,null,null,"Alta","Media","Baja",4]
[null,null,null,"Media","Media","Baja",4]
[null,null,null,"Baja","Media","Alta",4]
[null,null,null,"Baja","Media","Media",4]
[null,null,null,"Baja","Media","Baja",4]
[null,null,null,"Alta","Baja","Alta",4]
[null,null,null,"Media","Baja","Alta",5]
[null,null,null,"Alta","Baja","Media",5]
[null,null,null,"Media","Baja","Media",5]
[null,null,null,"Baja","Baja","Alta",5]
[null,null,null,"Alta","Baja","Baja",5]
[null,null,null,"Media","Baja","Baja",6]
[null,null,null,"Baja","Baja","Media",6]
[null,null,null,"Baja","Baja","Baja",6]
[]
[]
[]
[]
["Tecnologías a Evaluar"]
[]
["Ponderación","Valor",null,null,"Indicador","Peso ponderación"]
["Alta",">=",8,null,"Tecnología según mercado atendido",0.4]
["Media","4<n<8",null,null,"Relación costo beneficio",0.05]
["Baja","<",4,null,"Potencial de desvío de residuos a relleno sanitario (tpa) - límite inferior",0.1]
[null,null,null,null,"Potencial de desvío de residuos a relleno sanitario (tpa) - límite superior",0.05]
[null,null,null,null,"Potencial de reducción de emisión de GEI",0.1]
[null,null,null,null,"Alternativa más económica",0.3]
[]
[]
["Tecnología según mercado atendido",null,null,"Relación costo beneficio",null,null,"Potencial de desvío de residuos a relleno sanitario (tpa) - límite inferior"]
["Resultado","Valor",null,"Resultado","Valor",null,"Resultado","Valor"]
["Tecología más apropiada",10,null,"Mayor a 1",10,null,1,10]
["Tecnología apropiada ",5,null,"Igual a 1",5,null,2,8]
["Tecnología no apropiada",3,null,"Menor a 1",1,null,3,6]
[null,null,null,null,null,null,"Otros",4]
[]
[]
[]
["Potencial de desvío de residuos a relleno sanitario (tpa) - límite superior",null,null,"Potencial de reducción de emisión de GEI",null,null,"Alternativa más económica"]
["Resultado","Valor",null,"Resultado","Valor",null,"Resultado","Valor"]
[1,10,null,0.9,10,null,1,10]
[2,8,null,0.75,8,null,2,8]
[3,6,null,0.6,6,null,3,6]
["Otros",4,null,0.45,4,null,"Otros",4]
[0.3,2,null,0.3,2,null,0.3,2]

{"sheet":"Fichas técnicas Tecnologías","index":8,"n_rows":10,"n_cols":26,"rows_kept":10,"cut":false,"hidden":true,"merged":[[8,0,9,0],[0,13,0,14],[5,0,7,0],[5,7,7,7],[5,5,7,5],[5,6,7,6]]}
["Tecnología","Descripción","Escala y capacidad óptima (ton/año)","Recomendaciones específicas","Complejidad","Recomendaciones específicas","Tipo de residuos tratados","Recomendaciones específicas","Salidas","Recomendaciones específicas","Impacto ambiental","Recomendaciones específicas","Recomendaciones específicas sobre GEI","Desviación de residuos (ton/año)",null,"% Reducción de GEI en comparación con su disposición final en relleno sanitario","Potencial transformación (ton subproducto/ton residuos)","Ingresos venta supproductos (USD) por unidad","% de rechazo de residuos","Recomendaciones adicionales","Recomendaciones Humedad","Definición del área requerida por tecnologia de tratamiento para residuos sólidos totales","Definición del área requerida por tecnologia de tratamiento para residuos de poda corte de cesped y plazas de mercado","Definición del volumen para tratamiento para residuos sólidos totales","Definición del volumen para residuos de poda corte de cesped y plazas de mercado","Definición del volumen para desviación de residuos órganicos"]
[null,null,null,null,null,null,null,null,null,null,null,null,null,"% inferior","% superior"]
["Compostaje en pilas con volteo manual","Descomposición de la materia orgánica por microorganismos en condiciones aerobias, llevada a cabo en montículos de RSO bajo condiciones controladas y cuyos requerimientos de oxígeno son alcanzados mezclando las pilas frecuentemente.","1000 - 200000 ",{"$f":"IF(Cálculo!$B$127<1000,_xlfn.CONCAT(\"Dado que el proyecto busca dar tratamiento a aproximadamente a \",ROUNDDOWN(Cálculo!$B$127,0),\" toneladas anuales de residuos orgánicos, para una implementación adecuada de la tecnología se recomienda abarcar un mercado mayor, incluyendo otros municipios dentro del proyecto. \",IF('Datos de entrada'!$B$11=\"No\",\"Se recomienda considerar los residuos orgánicos provenientes de plazas de mercado y centrales de abasto para alcanzar la éscala óptima de la tecnología. \",\"\"),IF('Datos de entrada'!$B$13=\"No\",\"Además, se recomienda considerar los residuos orgánicos provenientes de corte de césped y poda de árboles para alcanzar la éscala óptima de la tecnología\",\"\")),IF(Cálculo!$B$127>200000,_xlfn.CONCAT(\"Dado que el proyecto busca dar tratamiento a aproximadamente a \",ROUNDDOWN(Cálculo!$B$127,0),\" toneladas anuales de residuos orgánicos, se recomienda analizar la implementación de una mezcla de tecnologías y plantas de tratamiento en diferentes localizaciones para cubrir la demanda\",\". Todas las estimaciones realizadas parten de la capacidad de una planta de tratamiento de 200.000 toneladas al año\"),_xlfn.CONCAT(\"Dado que el proyecto busca dar tratamiento a aproximadamente a \",ROUNDDOWN(Cálculo!$B$127,0),\" toneladas anuales de residuos orgánicos, cuenta con una escala adecuada para implementar la tecnología\")))","v":"Dado que el proyecto busca dar tratamiento a aproximadamente a 45725 toneladas anuales de residuos orgánicos, cuenta con una escala adecuada para implementar la tecnología"},"Baja-media",{"$f":"IF(Cálculo!$C$136=Ponderaciones!$A$24,\"Esta tecnología no requiere personal muy tecnificado ni equipos con especificaciones técnicas elevadas.\"&\"Su principal barrera se presenta por la incorrecta separación en la fuente de los residuos por parte del suscriptor.\"&\"De acuerdo con la información suministrada la población atendida cuenta con buenas prácticas en este aspecto.\"&\" Igualmente es recomendable desarrollar campañas educativas que mantengan a los habitantes enterados sobre las buenas prácticas en gestión de residuos sólidos\",IF(Cálculo!$C$136=Ponderaciones!$A$25,\"Esta tecnología no requiere personal muy tecnificado ni equipos con especificaciones técnicas elevadas.\"&\"Su principal barrera se presenta por la incorrecta separación en la fuente de los residuos por parte del suscriptor.\"&\"Dados las salidas obtenidas por el modelo en este aspecto se recomienda desarrollar campañas educativas que mantengan a los habitantes\"&\" enterados sobre las buenas prácticas en gestión de residuos sólidos enfocados en la separación en la fuente de residuos sólidos orgánicos y en economía circular\",\"Esta tecnología no requiere personal muy tecnificado ni equipos con especificaciones técnicas elevadas.\"&\"Su principal barrera se presenta por la incorrecta separación en la fuente de los residuos por parte del suscriptor.\"&\" Dadas las salidas obtenidas por el modelo en este aspecto antes de implementar la tecnología es urgente desarrollar campañas\"&\" enfocadas en la separación en la fuente de residuos orgánicos la economía circular y los impactos negativos a la salud humana y del ambiente por una inadecuada gestión de residuos sólidos\"))","v":"Esta tecnología no requiere personal muy tecnificado ni equipos con especificaciones técnicas elevadas.Su principal barrera se presenta por la incorrecta separación en la fuente de los residuos por parte del suscriptor.Dados las salidas obtenidas por el modelo en este aspecto se recomienda desarrollar campañas educativas que mantengan a los habitantes enterados sobre las buenas prácticas en gestión de residuos sólidos enfocados en la separación en la fuente de residuos sólidos orgánicos y en economía circular"},"Residuos Sólidos Orgánicos (RSO)",{"$f":"IF(OR('Datos de entrada'!$B$11=\"No\",'Datos de entrada'!$B$13=\"No\"),IF(Cálculo!$C$136=Ponderaciones!$A$24,\"Dada que se cuenta con una separación en la fuente adecuada, los RSO entregados serán homogéneos disminuyendo\"&\" los costos de su adecuación para el tratamiento.\"&\" Además, se recomienda incluir los residuos provenientes de poda de árboles o corte de cesped,\"&\" o los de plaas de mercado y centrales de abasto\",IF(Cálculo!$C$136=Ponderaciones!$A$25,\"Dada que se cuenta con una separación en la fuente medianamente adecuada,\"&\" es necesario fortalecerla con campañas, lo cual permitirá que los residuos destinados a tratamiento\"&\" sean más homogéneos y así disminuir los costos de su adecuación para su tratamiento.\",\"Antes de considerar desarrollar un proyecto de tratamiento de residuos sólidos, es necesario elevar los niveles de separación en la fuente para garantizar su éxito.\")), IF(Cálculo!$C$136=Ponderaciones!$A$24,\"Dada que se cuenta con una separación en la fuente adecuada, los RSO entregados serán homogéneos disminuyendo\"&\" los costos de su adecuación para el tratamiento.\",IF(Cálculo!$C$136=Ponderaciones!$A$25,\"Dada que se cuenta con una separación en la fuente medianamente adecuada,\"&\" es necesario fortalecerla con campañas, lo cual permitirá que los residuos destinados a tratamiento\"&\" sean más homogéneos y así disminuir los costos de su adecuación para su tratamiento.\",\"Antes de considerar desarrollar un proyecto de tratamiento de residuos sólidos, es necesario elevar los niveles de separación en la fuente para garantizar su éxito.\")))","v":"Dada que se cuenta con una separación en la fuente medianamente adecuada, es necesario fortalecerla con campañas, lo cual permitirá que los residuos destinados a tratamiento sean más homogéneos y así disminuir los costos de su adecuación para su tratamiento."},"Compost",null,"Olores\nRuido\nContaminación visual",{"$f":"\"Implemente prácticas adecuadas en la operación del sistema permite evitar el impacto ambiental ocasionado.\"&\" Se recomienda que revise literatura y otras experiencias sobre cómo monitorear, entre otras variables, el tamaño de las partículas, el contenido de carbono y nitrógeno, el contenido de humedad, la temperatura, el pH y la presencia de patógenos.\"&\"  Algunas Corporaciones Autónomas Regionales han expedido manuales al respecto, así como entidades tales como la UAESP de Bogotá y organizaciones como ACODAL.\"&IF(X3>=20000,\" El tamaño de la planta requiere licenciamiento ambiental, por lo tanto debe elaborar el plan de manejo ambiental y adelantar los tramites para obtenerla.\",\"\")","v":"Implemente prácticas adecuadas en la operación del sistema permite evitar el impacto ambiental ocasionado. Se recomienda que revise literatura y otras experiencias sobre cómo monitorear, entre otras variables, el tamaño de las partículas, el contenido de carbono y nitrógeno, el contenido de humedad, la temperatura, el pH y la presencia de patógenos.  Algunas Corporaciones Autónomas Regionales han expedido manuales al respecto, así como entidades tales como la UAESP de Bogotá y organizaciones como ACODAL. El tamaño de la planta requiere licenciamiento ambiental, por lo tanto debe elaborar el plan de manejo ambiental y adelantar los tramites para obtenerla."}," Si usted desea hacer una estimación de toneladas equivalentes de CO2 puede remitirse a la herramienta de cálculo de gases de efecto invernadero (GEI) en el manejo de residuos sólidos (MRS) en este link https://www.bivica.org/file/view/id/1081 y al https://www.ifeu.de/en/project/tool-for-calculating-greenhouse-gases-ghg-in-solid-waste-management-swm/",0.25,0.38,0.42,0.6,60,null,{"$f":"\"Tenga presente que la tecnologia de Compostaje con volteo manual requiere mayor área frente a la tecnología con aireación forzada. Para una planta de \"&X3&\" toneladas por año se requieren de \"&V3&\" hectaréas frente a un área de \"&V4&\" hectareas para la segunda\"&\"\"\"Esta tecnología presenta menor resistencia a los cambios metereológicos.\"","v":"Tenga presente que la tecnologia de Compostaje con volteo manual requiere mayor área frente a la tecnología con aireación forzada. Para una planta de 46000 toneladas por año se requieren de 16 hectaréas frente a un área de 13 hectareas para la segunda\"Esta tecnología presenta menor resistencia a los cambios metereológicos."},{"$f":"+IF(Valoración!H3=\"No adecuado\",\"La humedad existente no es suficiente, se debe aumentar su contenido para lo cual deberá evaluar su costo. \",\"\")","v":"La humedad existente no es suficiente, se debe aumentar su contenido para lo cual deberá evaluar su costo. "},{"$f":"Valoración!C3*0.8/10000","v":16},{"$f":"('Datos de entrada'!B12+'Datos de entrada'!B14)/Valoración!C3*0.6","v":0},{"$f":"ROUND(IF(AND(Cálculo!B127<=Valoración!C3,Cálculo!B127>=Valoración!B3),Cálculo!B127,Valoración!C3),-3)","v":46000},{"$f":"+IF(AND(Cálculo!$C$128<=Valoración!C3,Cálculo!$B$128>=Valoración!B3),Cálculo!$C$128,Valoración!C3)","v":200000},{"$f":"+IF(Cálculo!$B$127>=Valoración!C3,Valoración!C3*(1-N3),Cálculo!$B$127*(1-N3))","v":34293.873735607456}]
["Compostaje en pilas con aireación forzada","Proceso similar al compostaje en pilas con volteo manual, cuya diferencia radica en que el oxígeno requerido es inyectado mecánicamente. ","1000 - 200000",{"$f":"IF(Cálculo!$B$127<1000,_xlfn.CONCAT(\"Dado que el proyecto busca dar tratamiento a aproximadamente a \",ROUNDDOWN(Cálculo!$B$127,0),\" toneladas anuales de residuos orgánicos, para una implementación adecuada de la tecnología se recomienda abarcar un mercado mayor, incluyendo otros municipios dentro del proyecto. \",IF('Datos de entrada'!$B$11=\"No\",\"Se recomienda considerar los residuos orgánicos provenientes de plazas de mercado y centrales de abasto para alcanzar la éscala óptima de la tecnología. \",\"\"),IF('Datos de entrada'!$B$13=\"No\",\"Además, se recomienda considerar los residuos orgánicos provenientes de corte de césped y poda de árboles para alcanzar la éscala óptima de la tecnología\",\"\")),IF(Cálculo!$B$127>200000,_xlfn.CONCAT(\"Dado que el proyecto busca dar tratamiento a aproximadamente a \",ROUNDDOWN(Cálculo!$B$127,0),\" toneladas anuales de residuos orgánicos, se recomienda analizar la implementación de una mezcla de tecnologías y plantas de tratamiento en diferentes localizaciones para cubrir la demanda\",\". Todas las estimaciones realizadas parten de la capacidad de una planta de tratamiento de 200.000 toneladas al año\"),_xlfn.CONCAT(\"Dado que el proyecto busca dar tratamiento a aproximadamente a \",ROUNDDOWN(Cálculo!$B$127,0),\" toneladas anuales de residuos orgánicos, cuenta con una escala adecuada para implementar la tecnología\")))","v":"Dado que el proyecto busca dar tratamiento a aproximadamente a 45725 toneladas anuales de residuos orgánicos, cuenta con una escala adecuada para implementar la tecnología"},"Baja-media",{"$f":"IF(Cálculo!$C$136=Ponderaciones!$A$24,\"Esta tecnología no requiere personal muy tecnificado ni equipos con especificaciones técnicas elevadas.\"&\"Su principal barrera se presenta por la incorrecta separación en la fuente de los residuos por parte del suscriptor.\"&\"De acuerdo con la información suministrada la población atendida cuenta con buenas prácticas en este aspecto.\"&\" Igualmente es recomendable desarrollar campañas educativas que mantengan a los habitantes enterados sobre las buenas prácticas en gestión de residuos sólidos\",IF(Cálculo!$C$136=Ponderaciones!$A$25,\"Esta tecnología no requiere personal muy tecnificado ni equipos con especificaciones técnicas elevadas.\"&\"Su principal barrera se presenta por la incorrecta separación en la fuente de los residuos por parte del suscriptor.\"&\"Dados las salidas obtenidas por el modelo en este aspecto se recomienda desarrollar campañas educativas que mantengan a los habitantes\"&\" enterados sobre las buenas prácticas en gestión de residuos sólidos enfocados en la separación en la fuente de residuos sólidos orgánicos y en economía circular\",\"Esta tecnología no requiere personal muy tecnificado ni equipos con especificaciones técnicas elevadas.\"&\"Su principal barrera se presenta por la incorrecta separación en la fuente de los residuos por parte del suscriptor.\"&\" Dadas las salidas obtenidas por el modelo en este aspecto antes de implementar la tecnología es urgente desarrollar campañas\"&\" enfocadas en la separación en la fuente de residuos orgánicos la economía circular y los impactos negativos a la salud humana y del ambiente por una inadecuada gestión de residuos sólidos\"))","v":"Esta tecnología no requiere personal muy tecnificado ni equipos con especificaciones técnicas elevadas.Su principal barrera se presenta por la incorrecta separación en la fuente de los residuos por parte del suscriptor.Dados las salidas obtenidas por el modelo en este aspecto se recomienda desarrollar campañas educativas que mantengan a los habitantes enterados sobre las buenas prácticas en gestión de residuos sólidos enfocados en la separación en la fuente de residuos sólidos orgánicos y en economía circular"},"Residuos Sólidos Orgánicos (RSO)",{"$f":"IF(OR('Datos de entrada'!$B$11=\"No\",'Datos de entrada'!$B$13=\"No\"),IF(Cálculo!$C$136=Ponderaciones!$A$24,\"Dada que se cuenta con una separación en la fuente adecuada, los RSO entregados serán homogéneos disminuyendo\"&\" los costos de su adecuación para el tratamiento.\"&\" Además, se recomienda incluir los residuos provenientes de poda de árboles o corte de cesped,\"&\" o los de plaas de mercado y centrales de abasto\",IF(Cálculo!$C$136=Ponderaciones!$A$25,\"Dada que se cuenta con una separación en la fuente medianamente adecuada,\"&\" es necesario fortalecerla con campañas, lo cual permitirá que los residuos destinados a tratamiento\"&\" sean más homogéneos y así disminuir los costos de su adecuación para su tratamiento.\",\"Antes de considerar desarrollar un proyecto de tratamiento de residuos sólidos, es necesario elevar los niveles de separación en la fuente para garantizar su éxito.\")), IF(Cálculo!$C$136=Ponderaciones!$A$24,\"Dada que se cuenta con una separación en la fuente adecuada, los RSO entregados serán homogéneos disminuyendo\"&\" los costos de su adecuación para el tratamiento.\",IF(Cálculo!$C$136=Ponderaciones!$A$25,\"Dada que se cuenta con una separación en la fuente medianamente adecuada,\"&\" es necesario fortalecerla con campañas, lo cual permitirá que los residuos destinados a tratamiento\"&\" sean más homogéneos y así disminuir los costos de su adecuación para su tratamiento.\",\"Antes de considerar desarrollar un proyecto de tratamiento de residuos sólidos, es necesario elevar los niveles de separación en la fuente para garantizar su éxito.\")))","v":"Dada que se cuenta con una separación en la fuente medianamente adecuada, es necesario fortalecerla con campañas, lo cual permitirá que los residuos destinados a tratamiento sean más homogéneos y así disminuir los costos de su adecuación para su tratamiento."},"Compost",null,"Olores\nRuido\nContaminación visual",{"$f":"\"Implemente prácticas adecuadas en la operación del sistema permite evitar el impacto ambiental ocasionado.\"&\" Se recomienda que revise literatura y otras experiencias sobre cómo monitorear, entre otras variables, el tamaño de las partículas, el contenido de carbono y nitrógeno, el contenido de humedad, la temperatura, el pH y la presencia de patógenos.\"&\"  Algunas Corporaciones Autónomas Regionales han expedido manuales al respecto, así como entidades tales como la UAESP de Bogotá y organizaciones como ACODAL.\"&IF(X4>=20000,\" El tamaño de la planta requiere licenciamiento ambiental, por lo tanto debe elaborar el plan de manejo ambiental y adelantar los tramites para obtenerla.\",\"\")","v":"Implemente prácticas adecuadas en la operación del sistema permite evitar el impacto ambiental ocasionado. Se recomienda que revise literatura y otras experiencias sobre cómo monitorear, entre otras variables, el tamaño de las partículas, el contenido de carbono y nitrógeno, el contenido de humedad, la temperatura, el pH y la presencia de patógenos.  Algunas Corporaciones Autónomas Regionales han expedido manuales al respecto, así como entidades tales como la UAESP de Bogotá y organizaciones como ACODAL. El tamaño de la planta requiere licenciamiento ambiental, por lo tanto debe elaborar el plan de manejo ambiental y adelantar los tramites para obtenerla."},{"$f":"+M3","v":" Si usted desea hacer una estimación de toneladas equivalentes de CO2 puede remitirse a la herramienta de cálculo de gases de efecto invernadero (GEI) en el manejo de residuos sólidos (MRS) en este link https://www.bivica.org/file/view/id/1081 y al https://www.ifeu.de/en/project/tool-for-calculating-greenhouse-gases-ghg-in-solid-waste-management-swm/"},0.28000000000000003,0.41,0.4,0.5,60,null,{"$f":"\"Tenga presente que la tecnologia de Compostaje con aireación forzada requiere menos áreas frente a la tecnología con volteo manual. Para una planta de \"&X4&\" toneladas por año se requieren de \"&V4&\" hectaréas frente a un área de \"&V3&\" hectareas para la segunda.\"&\" Esta tecnología presenta mayor resistencia a los cambios metereológicos, sin embargo, demanda mayor monitoreo.\"","v":"Tenga presente que la tecnologia de Compostaje con aireación forzada requiere menos áreas frente a la tecnología con volteo manual. Para una planta de 46000 toneladas por año se requieren de 13 hectaréas frente a un área de 16 hectareas para la segunda. Esta tecnología presenta mayor resistencia a los cambios metereológicos, sin embargo, demanda mayor monitoreo."},{"$f":"+IF(Valoración!H4=\"No adecuado\",\"La humedad existente no es suficiente, se debe aumentar su contenido para lo cual deberá evaluar su costo. \",\"\")","v":"La humedad existente no es suficiente, se debe aumentar su contenido para lo cual deberá evaluar su costo. "},{"$f":"Valoración!C4*0.65/10000","v":13},{"$f":"('Datos de entrada'!B12+'Datos de entrada'!B14)/Valoración!C4*0.38","v":0},{"$f":"ROUND(IF(AND(Cálculo!$B$127<=Valoración!C4,Cálculo!$B$127>=Valoración!B4),Cálculo!$B$127,Valoración!C4),-3)","v":46000},{"$f":"+IF(AND(Cálculo!$C$128<=Valoración!C4,Cálculo!$B$128>=Valoración!B4),Cálculo!$C$128,Valoración!C4)","v":200000},{"$f":"+IF(Cálculo!$B$127>=Valoración!C4,Valoración!C4*(1-N4),Cálculo!$B$127*(1-N4))","v":32922.118786183157}]
["Compostaje cerrado o \"In vessel\"","Proceso de compostaje (degradación de la materia orgánica en condiciones aerobias) realizado en reactores cerrados en condiciones controladas.","5000 - 300000",{"$f":"IF(Cálculo!$B$127<5000,_xlfn.CONCAT(\"Dado que el proyecto busca dar tratamiento a aproximadamente a \",ROUNDDOWN(Cálculo!$B$127,0),\" toneladas anuales de residuos orgánicos, para una implementación adecuada de la tecnología se recomienda abarcar un mercado mayor, incluyendo otros municipios dentro del proyecto. \",IF('Datos de entrada'!$B$11=\"No\",\"Se recomienda considerar los residuos orgánicos provenientes de plazas de mercado y centrales de abasto para alcanzar la éscala óptima de la tecnología. \",\"\"),IF('Datos de entrada'!$B$13=\"No\",\"Además, se recomienda considerar los residuos orgánicos provenientes de corte de césped y poda de árboles para alcanzar la éscala óptima de la tecnología\",\"\")),IF(Cálculo!$B$127>300000,_xlfn.CONCAT(\"Dado que el proyecto busca dar tratamiento a aproximadamente a \",ROUNDDOWN(Cálculo!$B$127,0),\" toneladas anuales de residuos orgánicos, se recomienda analizar la implementación de una mezcla de tecnologías y plantas de tratamiento en diferentes localizaciones para cubrir la demanda\",\". Todas las estimaciones realizadas parten de la capacidad de una planta de tratamiento de 300.000 toneladas al año\"),_xlfn.CONCAT(\"Dado que el proyecto busca dar tratamiento a aproximadamente a \",ROUNDDOWN(Cálculo!$B$127,0),\" toneladas anuales de residuos orgánicos, cuenta con una escala adecuada para implementar la tecnología\")))","v":"Dado que el proyecto busca dar tratamiento a aproximadamente a 45725 toneladas anuales de residuos orgánicos, cuenta con una escala adecuada para implementar la tecnología"},"Baja-media",{"$f":"IF(Cálculo!$C$136=Ponderaciones!$A$24,\"Esta tecnología no requiere personal muy tecnificado ni equipos con especificaciones técnicas elevadas.\"&\"Su principal barrera se presenta por la incorrecta separación en la fuente de los residuos por parte del suscriptor.\"&\"De acuerdo con la información suministrada la población atendida cuenta con buenas prácticas en este aspecto.\"&\" Igualmente es recomendable desarrollar campañas educativas que mantengan a los habitantes enterados sobre las buenas prácticas en gestión de residuos sólidos\",IF(Cálculo!$C$136=Ponderaciones!$A$25,\"Esta tecnología no requiere personal muy tecnificado ni equipos con especificaciones técnicas elevadas.\"&\"Su principal barrera se presenta por la incorrecta separación en la fuente de los residuos por parte del suscriptor.\"&\"Dados las salidas obtenidas por el modelo en este aspecto se recomienda desarrollar campañas educativas que mantengan a los habitantes\"&\" enterados sobre las buenas prácticas en gestión de residuos sólidos enfocados en la separación en la fuente de residuos sólidos orgánicos y en economía circular\",\"Esta tecnología no requiere personal muy tecnificado ni equipos con especificaciones técnicas elevadas.\"&\"Su principal barrera se presenta por la incorrecta separación en la fuente de los residuos por parte del suscriptor.\"&\" Dadas las salidas obtenidas por el modelo en este aspecto antes de implementar la tecnología es urgente desarrollar campañas\"&\" enfocadas en la separación en la fuente de residuos orgánicos la economía circular y los impactos negativos a la salud humana y del ambiente por una inadecuada gestión de residuos sólidos\"))","v":"Esta tecnología no requiere personal muy tecnificado ni equipos con especificaciones técnicas elevadas.Su principal barrera se presenta por la incorrecta separación en la fuente de los residuos por parte del suscriptor.Dados las salidas obtenidas por el modelo en este aspecto se recomienda desarrollar campañas educativas que mantengan a los habitantes enterados sobre las buenas prácticas en gestión de residuos sólidos enfocados en la separación en la fuente de residuos sólidos orgánicos y en economía circular"},"Residuos Sólidos Orgánicos (RSO)",{"$f":"IF(OR('Datos de entrada'!$B$11=\"No\",'Datos de entrada'!$B$13=\"No\"),IF(Cálculo!$C$136=Ponderaciones!$A$24,\"Dada que se cuenta con una separación en la fuente adecuada, los RSO entregados serán homogéneos disminuyendo\"&\" los costos de su adecuación para el tratamiento.\"&\" Además, se recomienda incluir los residuos provenientes de poda de árboles o corte de cesped,\"&\" o los de plaas de mercado y centrales de abasto\",IF(Cálculo!$C$136=Ponderaciones!$A$25,\"Dada que se cuenta con una separación en la fuente medianamente adecuada,\"&\" es necesario fortalecerla con campañas, lo cual permitirá que los residuos destinados a tratamiento\"&\" sean más homogéneos y así disminuir los costos de su adecuación para su tratamiento.\",\"Antes de considerar desarrollar un proyecto de tratamiento de residuos sólidos, es necesario elevar los niveles de separación en la fuente para garantizar su éxito.\")), IF(Cálculo!$C$136=Ponderaciones!$A$24,\"Dada que se cuenta con una separación en la fuente adecuada, los RSO entregados serán homogéneos disminuyendo\"&\" los costos de su adecuación para el tratamiento.\",IF(Cálculo!$C$136=Ponderaciones!$A$25,\"Dada que se cuenta con una separación en la fuente medianamente adecuada,\"&\" es necesario fortalecerla con campañas, lo cual permitirá que los residuos destinados a tratamiento\"&\" sean más homogéneos y así disminuir los costos de su adecuación para su tratamiento.\",\"Antes de considerar desarrollar un proyecto de tratamiento de residuos sólidos, es necesario elevar los niveles de separación en la fuente para garantizar su éxito.\")))","v":"Dada que se cuenta con una separación en la fuente medianamente adecuada, es necesario fortalecerla con campañas, lo cual permitirá que los residuos destinados a tratamiento sean más homogéneos y así disminuir los costos de su adecuación para su tratamiento."},"Compost",null,"Olores ",{"$f":"\"El control de olores de los sistemas de compostaje generalmente se logra mediante la aplicación de oxígeno para evitar reacciones anaeróbicas (sin presencia de este gas).\"&IF(X4>=20000,\" El tamaño de la planta requiere licenciamiento ambiental, por lo tanto debe elaborar el plan de manejo ambiental y adelantar los tramites para obtenerla.\",\"\")","v":"El control de olores de los sistemas de compostaje generalmente se logra mediante la aplicación de oxígeno para evitar reacciones anaeróbicas (sin presencia de este gas). El tamaño de la planta requiere licenciamiento ambiental, por lo tanto debe elaborar el plan de manejo ambiental y adelantar los tramites para obtenerla."},{"$f":"+M4","v":" Si usted desea hacer una estimación de toneladas equivalentes de CO2 puede remitirse a la herramienta de cálculo de gases de efecto invernadero (GEI) en el manejo de residuos sólidos (MRS) en este link https://www.bivica.org/file/view/id/1081 y al https://www.ifeu.de/en/project/tool-for-calculating-greenhouse-gases-ghg-in-solid-waste-management-swm/"},0.52,0.52,0.38,0.5,60,null,{"$f":"+IF(OR('Datos de entrada'!B11=\"SI\",'Datos de entrada'!B13=\"SI\"),\" Es importante tener presente que el material estabilizado resultante no es recomendado para uso agricola y debe disponerse. \",\"\")","v":""},{"$f":"+IF(Valoración!H5=\"No adecuado\",\"La humedad existente no es suficiente, se debe aumentar su contenido para lo cual deberá evaluar su costo. \",\"\")","v":"La humedad existente no es suficiente, se debe aumentar su contenido para lo cual deberá evaluar su costo. "},null,null,{"$f":"ROUND(IF(AND(Cálculo!$B$127<=Valoración!C5,Cálculo!$B$127>=Valoración!B5),Cálculo!$B$127,Valoración!C5),-3)","v":46000},{"$f":"+IF(AND(Cálculo!$C$128<=Valoración!C5,Cálculo!$B$128>=Valoración!B5),Cálculo!$C$128,Valoración!C5)","v":300000},{"$f":"+IF(Cálculo!$B$127>=Valoración!C5,Valoración!C5*(1-N5),Cálculo!$B$127*(1-N5))","v":21948.079190788769}]
["Tratamiento Mecánico Biológico","Combinación de tratamientos físicos con tratamientos biológicos para el aprovechamiento de la fracción orgánica e inorgánica de los residuos sólidos. Esta tecnología es priorizada sobre las demás, dado los lineamientos del Plan Integral de Gestión de Cambio Climático Sectorial adoptado mediante la Resolución 431 de 2020.","20000-500000",{"$f":"IF(Cálculo!$B$127<20000,_xlfn.CONCAT(\"Dado que el proyecto busca dar tratamiento a aproximadamente a \",ROUNDDOWN(Cálculo!$B$127,0),\" toneladas anuales de residuos  sólidos, para una implementación adecuada de la tecnología se recomienda abarcar un mercado mayor, incluyendo otros municipios dentro del proyecto. \",IF('Datos de entrada'!$B$11=\"No\",\"Se recomienda considerar los residuos orgánicos provenientes de plazas de mercado y centrales de abasto para alcanzar la éscala óptima de la tecnología. \",\"\"),IF('Datos de entrada'!$B$13=\"No\",\"Además, se recomienda considerar los residuos orgánicos provenientes de corte de césped y poda de árboles para alcanzar la éscala óptima de la tecnología.\",\"\"), \"Esta tecnología puede tratar residuos inorgánicos, logrando su separación para su posterior reciclaje, por lo que se recomienda identificar fuentes de estos residuos que permitan alcanzar la escala óptima de la tecnología\"),IF(Cálculo!$B$127>500000,_xlfn.CONCAT(\"Dado que el proyecto busca dar tratamiento a aproximadamente a \",ROUNDDOWN(Cálculo!$B$127,0),\" toneladas anuales de residuos sólidos se recomienda analizar la implementación de una mezcla de tecnologías y plantas de tratamiento en diferentes localizaciones para cubrir la demanda\",\". Todas las estimaciones realizadas parten de la capacidad de una planta de tratamiento de 500.000 toneladas al año\"),_xlfn.CONCAT(\"Dado que el proyecto busca dar tratamiento a aproximadamente a \",ROUNDDOWN(Cálculo!$B$127,0),\" toneladas anuales de residuos sólidos, cuenta con una escala adecuada para implementar la tecnología.\")))","v":"Dado que el proyecto busca dar tratamiento a aproximadamente a 45725 toneladas anuales de residuos sólidos, cuenta con una escala adecuada para implementar la tecnología."},"Media-alta",{"$f":"IF(Cálculo!$C$136=Ponderaciones!$A$24,\"Esta tecnología requiere personal medianamente tecnificado para el adecuado uso de los equipos y su mantenimiento.\"&\"Para su uso óptimo se requiere una adecuada separación en la fuente de los residuos por parte del suscriptor.\"&\"De acuerdo con la información suministrada la población atendida cuenta con buenas prácticas en este aspecto.\"&\" Igualmente es recomendable desarrollar campañas educativas que mantengan a los habitantes enterados sobre las buenas prácticas en gestión de residuos sólidos\",\"Esta tecnología requiere personal medianamente tecnificado para el adecuado uso de los equipos y su mantenimiento.\"&\"Para su uso óptimo se requiere una adecua separación en la fuente de los residuos por parte del suscriptor, pero no es necesaria.\"&\" Se recomienda desarrollar \"&\" que mantengan a los habitantes\"&\" enterados sobre las buenas prácticas en gestión de residuos sólidos enfocados en la separación en la fuente de residuos sólidos orgánicos y en economía circular.\")","v":"Esta tecnología requiere personal medianamente tecnificado para el adecuado uso de los equipos y su mantenimiento.Para su uso óptimo se requiere una adecua separación en la fuente de los residuos por parte del suscriptor, pero no es necesaria. Se recomienda desarrollar  que mantengan a los habitantes enterados sobre las buenas prácticas en gestión de residuos sólidos enfocados en la separación en la fuente de residuos sólidos orgánicos y en economía circular."},"Residuos domiciliarios sin separar",{"$f":"\"A mayor separación en la fuente mayor facilidad tienen los procesos del Tratamiento Mecánico Biológico. \"&IF(Cálculo!$C$136=Ponderaciones!$A$24,\"Dada que se cuenta con una separación en la fuente adecuada, los RSO entregados serán homogéneos disminuyendo\"&\" los costos de su adecuación para el tratamiento e incrementando la desviación de residuos que de otra forma irían al relleno.\",IF(Cálculo!$C$136=Ponderaciones!$A$25,\"Dada que se cuenta con una separación en la fuente medianamente adecuada,\"&\" es necesario fortalecerla con campañas, lo cual permitirá que los residuos destinados a tratamiento\"&\" sean más homogéneos y así disminuir los costos de su adecuación para su tratamiento e incrementar la desviación de residuos que de otra forma irían al relleno..\",\"Antes de considerar desarrollar un proyecto de tratamiento de residuos sólidos, es necesario elevar los niveles de separación en la fuente para garantizar su éxito.\"))&IF('Datos de entrada'!$B$28=\"No\", \"Es necesario implementar campañas para fortalecer la separación de residuos inorgánicos. \",\"\")&IF('Datos de entrada'!$B$27=\"No\", \" Por otro lado, se deben fortalecer la separación de residuos orgánicos a través de programas de sensibilización.\",\"\")","v":"A mayor separación en la fuente mayor facilidad tienen los procesos del Tratamiento Mecánico Biológico. Dada que se cuenta con una separación en la fuente medianamente adecuada, es necesario fortalecerla con campañas, lo cual permitirá que los residuos destinados a tratamiento sean más homogéneos y así disminuir los costos de su adecuación para su tratamiento e incrementar la desviación de residuos que de otra forma irían al relleno.."},"Compost y materiales reciclables",null,"Olores\nRuido\nContaminación visual",{"$f":"\"Un manejo adecuado de los residuos orgánicos permitirá evitar la generación de olores. Esto implica cortos períodos de almacenamiento para evitar su descomposición.\"&IF(X4>=20000,\" El tamaño de la planta requiere licenciamiento ambiental, por lo tanto debe elaborar el plan de manejo ambiental y adelantar los tramites para obtenerla.\",\"\")","v":"Un manejo adecuado de los residuos orgánicos permitirá evitar la generación de olores. Esto implica cortos períodos de almacenamiento para evitar su descomposición. El tamaño de la planta requiere licenciamiento ambiental, por lo tanto debe elaborar el plan de manejo ambiental y adelantar los tramites para obtenerla."},{"$f":"+M5","v":" Si usted desea hacer una estimación de toneladas equivalentes de CO2 puede remitirse a la herramienta de cálculo de gases de efecto invernadero (GEI) en el manejo de residuos sólidos (MRS) en este link https://www.bivica.org/file/view/id/1081 y al https://www.ifeu.de/en/project/tool-for-calculating-greenhouse-gases-ghg-in-solid-waste-management-swm/"},0.6,0.75,0.68,0.2,60,0.95,null,{"$f":"+IF(Valoración!H6=\"No adecuado\",\"La humedad existente no es suficiente, por ello se debe adicionar agua. \",\"\")","v":""},{"$f":"Cálculo!B127/Valoración!C6*0.25","v":2.2862582490404969E-2},{"$f":"('Datos de entrada'!B12+'Datos de entrada'!B14)/Valoración!C6*0.25","v":0},{"$f":"ROUND(IF(AND(Cálculo!$B$127<=Valoración!C6,Cálculo!$B$127>=Valoración!B6),Cálculo!$B$127,Valoración!C6),-3)","v":46000},{"$f":"+IF(AND(Cálculo!$C$128<=Valoración!C6,Cálculo!$B$128>=Valoración!B6),Cálculo!$C$128,Valoración!C6)","v":500000},{"$f":"+IF(Cálculo!$B$127>=Valoración!C6,Valoración!C6*(1-N6),Cálculo!$B$127*(1-N6))","v":18290.065992323976}]
[null,null,null,null,null,null,null,null,"RDF",null,null,null,null,null,null,null,0.46,30,{"$f":"IF('Datos de entrada'!$B$10>0,'Datos de entrada'!$B$10,'Información referencia'!$B$14)","v":0.6}]
[null,null,null,null,null,null,null,null,"Materiales reciclables",null,null,null,null,null,null,null,0.05,350,0.1]
["Digestión Anaerobia","Descomposición de la materia orgánica por microorganismos en condiciones anaerobias, la cual genera biogás que puede ser aprovechado energéticamente. Este proceso es llevado a cabo en reactores cerrados en condiciones controladas.","20000-500000",{"$f":"IF(Cálculo!$B$127<20000,_xlfn.CONCAT(\"Dado que el proyecto busca dar tratamiento a aproximadamente a \",ROUNDDOWN(Cálculo!$B$127,0),\" toneladas anuales de residuos orgánicos, para una implementación adecuada de la tecnología se recomienda abarcar un mercado mayor, incluyendo otros municipios dentro del proyecto. \",IF('Datos de entrada'!$B$11=\"No\",\"Se recomienda considerar los residuos orgánicos provenientes de plazas de mercado y centrales de abasto para alcanzar la éscala óptima de la tecnología. \",\"\"),IF('Datos de entrada'!$B$13=\"No\",\"Además, se recomienda considerar los residuos orgánicos provenientes de corte de césped y poda de árboles para alcanzar la éscala óptima de la tecnología\",\"\"), \"Esta tecnología, además, permite tratar residuos semi sólidos por lo que se recomienda incluir lodos sin contaminantes peligrosos para alcanzar la escala obtenida\"),IF(Cálculo!$B$127>500000,_xlfn.CONCAT(\"Dado que el proyecto busca dar tratamiento a aproximadamente a \",ROUNDDOWN(Cálculo!$B$127,0),\" toneladas anuales de residuos orgánicos, se recomienda analizar la implementación de una mezcla de tecnologías y plantas de tratamiento en diferentes localizaciones para cubrir la demanda\",\". Todas las estimaciones realizadas parten de la capacidad de una planta de tratamiento de 500.000 toneladas al año\"),_xlfn.CONCAT(\"Dado que el proyecto busca dar tratamiento a aproximadamente a \",ROUNDDOWN(Cálculo!$B$127,0),\" toneladas anuales de residuos orgánicos, cuenta con una escala adecuada para implementar la tecnología\")))","v":"Dado que el proyecto busca dar tratamiento a aproximadamente a 45725 toneladas anuales de residuos orgánicos, cuenta con una escala adecuada para implementar la tecnología"},"Media-alta",{"$f":"IF(Cálculo!$B$142=Ponderaciones!$A$145,\"Esta tecnología requiere personal con altas capacidades técnicas y equipos especializados.\"&\" Debe implementarse únicamente en escenarios con niveles de favorabilidad muy altos.\"&\"Dados los resultados del modelo, en un primer análisis es viable implementar la tecnología.\"&\" No obstante, este análisis debe complementarse con un estudio detallado que permita\"&\" identificar si su implementación es financieramente sostenible en el mediano plazo.\", \"Esta tecnología requiere personal con altas capacidades técnicas y equipos especializados.\"&\" Debe implementarse únicamente en escenarios con niveles de favorabilidad muy altos.\"&\"Dados los resultados del modelo, no se cuenta con los niveles de faborabilidad necesarios\"&\" Se recomienda analizar la implementación de una tecnología distinta.\")","v":"Esta tecnología requiere personal con altas capacidades técnicas y equipos especializados. Debe implementarse únicamente en escenarios con niveles de favorabilidad muy altos.Dados los resultados del modelo, no se cuenta con los niveles de faborabilidad necesarios Se recomienda analizar la implementación de una tecnología distinta."},"Residuos Sólidos Orgánicos (RSO)",{"$f":"IF(OR('Datos de entrada'!$B$11=\"No\",'Datos de entrada'!$B$13=\"No\"),IF(Cálculo!$C$136=Ponderaciones!$A$24,\"Dada que se cuenta con una separación en la fuente adecuada, los RSO entregados serán homogéneos disminuyendo\"&\" los costos de su adecuación para el tratamiento.\"&\" Además, se recomienda incluir los residuos provenientes de poda de árboles o corte de cesped,\"&\" o los de plaas de mercado y centrales de abasto\",IF(Cálculo!$C$136=Ponderaciones!$A$25,\"Dada que se cuenta con una separación en la fuente medianamente adecuada,\"&\" es necesario fortalecerla con campañas, lo cual permitirá que los residuos destinados a tratamiento\"&\" sean más homogéneos y así disminuir los costos de su adecuación para su tratamiento.\",\"Antes de considerar desarrollar un proyecto de tratamiento de residuos sólidos, es necesario elevar los niveles de separación en la fuente para garantizar su éxito.\")), IF(Cálculo!$C$136=Ponderaciones!$A$24,\"Dada que se cuenta con una separación en la fuente adecuada, los RSO entregados serán homogéneos disminuyendo\"&\" los costos de su adecuación para el tratamiento.\",IF(Cálculo!$C$136=Ponderaciones!$A$25,\"Dada que se cuenta con una separación en la fuente medianamente adecuada,\"&\" es necesario fortalecerla con campañas, lo cual permitirá que los residuos destinados a tratamiento\"&\" sean más homogéneos y así disminuir los costos de su adecuación para su tratamiento.\",\"Antes de considerar desarrollar un proyecto de tratamiento de residuos sólidos, es necesario elevar los niveles de separación en la fuente para garantizar su éxito.\")))","v":"Dada que se cuenta con una separación en la fuente medianamente adecuada, es necesario fortalecerla con campañas, lo cual permitirá que los residuos destinados a tratamiento sean más homogéneos y así disminuir los costos de su adecuación para su tratamiento."},"Biodigestato",null,"Olores ",{"$f":"\"El biogás generado presenta un característico olor a metano. No obstane, los equipos son cerrados y a menos que este sea liberado a la atmosfera esto no representa un impacto elevado.\"&IF(X4>=20000,\" El tamaño de la planta requiere licenciamiento ambiental, por lo tanto debe elaborar el plan de manejo ambiental y adelantar los tramites para obtenerla.\",\"\")","v":"El biogás generado presenta un característico olor a metano. No obstane, los equipos son cerrados y a menos que este sea liberado a la atmosfera esto no representa un impacto elevado. El tamaño de la planta requiere licenciamiento ambiental, por lo tanto debe elaborar el plan de manejo ambiental y adelantar los tramites para obtenerla."},{"$f":"+M6","v":" Si usted desea hacer una estimación de toneladas equivalentes de CO2 puede remitirse a la herramienta de cálculo de gases de efecto invernadero (GEI) en el manejo de residuos sólidos (MRS) en este link https://www.bivica.org/file/view/id/1081 y al https://www.ifeu.de/en/project/tool-for-calculating-greenhouse-gases-ghg-in-solid-waste-management-swm/"},0.33,0.65,0.57999999999999996,0.6,60,null,{"$f":"+IF(OR('Datos de entrada'!B11=\"SI\",'Datos de entrada'!B13=\"SI\"),\" Es importante tener presente que el material estabilizado resultante no es recomendado para uso agricola y debe disponerse. \",\"\")","v":""},{"$f":"+IF(Valoración!H7=\"No adecuado\",\"La humedad existente no es suficiente, se debe aumentar su contenido para lo cual deberá evaluar su costo. \",\"\")","v":"La humedad existente no es suficiente, se debe aumentar su contenido para lo cual deberá evaluar su costo. "},{"$f":"140000/Valoración!C7*0.1","v":2.8000000000000004E-2},{"$f":"('Datos de entrada'!B12+'Datos de entrada'!B14)/Valoración!C7*0.1","v":0},{"$f":"ROUND(IF(AND(Cálculo!$B$127<=Valoración!C7,Cálculo!$B$127>=Valoración!B7),Cálculo!$B$127,Valoración!C7),-3)","v":46000},{"$f":"+IF(AND(Cálculo!$C$128<=Valoración!C7,Cálculo!$B$128>=Valoración!B7),Cálculo!$C$128,Valoración!C7)","v":500000},{"$f":"+IF(Cálculo!$B$127>=Valoración!C7,Valoración!C7*(1-N9),Cálculo!$B$127*(1-N9))","v":30635.860537142657}]
[null,null,null,null,null,null,null,null,"Energía eléctrica",null,null,null,null,null,null,null,0.1,0.25]

{"sheet":"CDF y CRT-TMB","index":9,"n_rows":63,"n_cols":39,"rows_kept":63,"cut":false,"hidden":true,"merged":[[41,2,41,3]]}
[1,"CDF y CRT utilizados por el modelo"]
[2,null,null,null,null,null,"Fórmula","Estimación Proyecto"]
[3]
[4,null,null,null,null,null,"CDF + CRT",{"$f":"IF((Cálculo!$C$2/3)<5000,($H$31+'CDF y CRT-TMB'!$H$35),('CDF y CRT-TMB'!$H$21+$H$23))","v":221118.91604392539}]
[5]
[6]
[7]
[8]
[9]
[10]
[11]
[12]
[13]
[14,"Municipios CRA 720 de 2015",null,null,null,null,null,null,"TMB"]
[15,null,null,null,null,null,"Fórmula","Estimación Proyecto"]
[16,null,null,null,null,null,"QRS",{"$f":"I16/12","v":1341.666666666667},{"$f":"'Fichas técnicas Tecnologías'!$X$6*((1-'Fichas técnicas Tecnologías'!S6)+(1-'Fichas técnicas Tecnologías'!S7)-('Fichas técnicas Tecnologías'!S8))","v":16100.000000000004}]
[17,null,null,null,null,null,"D",{"$f":"IF('Datos de entrada'!$B$50=\"No\",'Datos de entrada'!$B$51,'Datos de entrada'!$B$34)","v":2}]
[18,null,null,null,null,null,"CDF=CDFVU+CDFPC ($ dic 2014)",{"$f":"H19+H20","v":123981.0713043478}]
[19,null,null,null,null,null,"CDFVU ($ dic 2014)",{"$f":"MIN(18722+(132924379/$H$16), 139896)","v":117796.0713043478}]
[20,null,null,null,null,null,"CDFPC ($ dic 2014)",{"$f":"MIN(242+(11652352/$H$16),6185)","v":6185}]
[21,null,null,null,null,null,"Actualización CDF($ año de inicio de operaciones)",{"$f":"+H18*((1+(2.23%*('Datos de entrada'!$B$5-2014))))","v":146099.29442504342}]
[22,null,null,null,null,null,"CRT",{"$f":"64745+(738*$H$17)+(8683846/$H$16)","v":72693.43180124223}]
[23,null,null,null,null,null,"Actualización CRT($ año de inicio de operaciones)",{"$f":"$H$22*((0.89+(0.003*('Datos de entrada'!$B$5-2014)))+(0.11+(0.001*('Datos de entrada'!$B$5-2014))))","v":75019.621618881982}]
[24]
[25]
[26,"Municipios CRA 853 de 2018"]
[27]
[28,null,null,null,null,null,"QRT",{"$f":"I16/12","v":1341.666666666667}]
[29,null,null,null,null,null,"D",{"$f":"IF('Datos de entrada'!$B$50=\"No\",'Datos de entrada'!$B$51,'Datos de entrada'!$B$34)","v":2}]
[30,null,null,null,null,null,"CRT ($ jul 2018)",{"$f":"IF($H$29<100,VLOOKUP($L$32,$A$43:$AM$62,$L$33,FALSE),25554+(1082*$H$29+(15659942/$H$28)))","v":73287}]
[31,null,null,null,null,null,"Actualización CRT($ año de inicio de operaciones)",{"$f":"$H$30*((0.89*(1+3%)^('Datos de entrada'!$B$5-2018))+(0.11*(1+1%)^('Datos de entrada'!$B$5-2018)))","v":81800.698169933996},{"$f":"+H31/H30","v":1.116169282}]
[32,null,null,null,null,null,"CDF=CDFVU+CDFPC ($ jul 2018)",{"$f":"+H33+H34","v":139562.92869565217},{"$f":"(I31^0.25)-1","v":2.7856570777651246E-2},null,"Fila",{"$f":"+ROW(B43)+INT(H29/5)","v":43}]
[33,null,null,null,null,null,"CDFVU ($ jul 2018)",{"$f":"MIN(21075+(149630621/$H$28), 157478)","v":132600.92869565217},null,null,"Columna",{"$f":"+IF(H28<=200,COLUMN(E41),IF(AND(H28>=200,H28<=365),COLUMN(F41)+INT((H28-200)/5),COLUMN(AM41)))","v":39},"Le inclui un condicional siendo que se salia del rango maximo"]
[34,null,null,null,null,null,"CDFPC ($ jul 2018)",{"$f":"MIN(272+(13116846/$H$28),6962)","v":6962}]
[35,null,null,null,null,null,"Actualización CRT($ año de inicio de operaciones)",{"$f":"+H32*((1+(2.23%*('Datos de entrada'!$B$5-2018))))","v":152011.94193530435}]
[36]
[37]
[38]
[39,1,2,3,1,2,3,4,5,6,7,8,9,10,11,12,13,14,15,16,17,18,19,20,21,22,23,24,25,29,30,31,32,33,34,35,36,37,38]
[40,null,null,null,"Ton/mes"]
[41,null,null,null,0,200,205,210,215,220,225,230,235,240,245,250,255,260,265,270,275,280,285,290,295,300,305,310,315,320,325,330,335,340,345,350,355,360,365]
[42,null,"km",null,200,205,210,215,220,225,230,235,240,245,250,255,260,265,270,275,280,285,290,295,300,305,310,315,320,325,330,335,340,345,350,355,360,365,10000000]
[43,1,0,5,109262,107352,105534,103799,102144,100562,99049,97600,96212,94881,93602,92374,91193,90056,88962,87908,86891,85910,84962,84047,83162,82306,81478,80676,79900,79147,78417,77708,77021,76354,75705,75075,74462,73866,73287]
[44,2,5,10,114671,112761,110942,109208,107553,105971,104458,103009,101621,100289,99011,97783,96602,95465,94371,93316,92299,91318,90371,89456,88571,87715,86887,86085,85308,84555,83825,83117,82430,81762,81114,80483,79871,79275,78695]
[45,3,10,15,120079,118170,116351,114617,112961,111379,109866,108418,107029,105698,104419,103191,102010,100874,99779,98725,97708,96727,95779,94864,93979,93124,92296,91494,90717,89964,89234,88526,87838,87171,86522,85892,85279,84684,84104]
[46,4,15,20,125488,123578,121759,120025,118370,116788,115275,113826,112438,111106,109828,108600,107419,106282,105188,104133,103117,102135,101188,100273,99388,98532,97704,96902,96125,95373,94643,93934,93247,92579,91931,91301,90688,90092,89512]
[47,5,20,25,130896,128987,127168,125434,123778,122197,120683,119235,117847,116515,115237,114008,112827,111691,110597,109542,108525,107544,106597,105681,104797,103941,103113,102311,101534,100781,100051,99343,98655,97988,97339,96709,96097,95501,94921]
[48,6,25,30,136305,134395,132577,130842,129187,127605,126092,124643,123255,121924,120645,119417,118236,117099,116005,114951,113934,112953,112005,111090,110205,109349,108521,107719,106943,106190,105460,104751,104064,103397,102748,102118,101505,100909,100330]
[49,7,30,35,141714,139804,137985,136251,134596,133014,131501,130052,128664,127332,126054,124826,123645,122508,121414,120359,119342,118361,117414,116499,115614,114758,113930,113128,112351,111598,110868,110160,109473,108805,108157,107526,106914,106318,105738]
[50,8,35,40,147122,145213,143394,141660,140004,138422,136909,135461,134072,132741,131462,130234,129053,127917,126822,125768,124751,123770,122822,121907,121022,120167,119339,118537,117760,117007,116277,115569,114881,114214,113565,112935,112322,111727,111147]
[51,9,40,45,152531,150621,148802,147068,145413,143831,142318,140869,139481,138149,136871,135643,134462,133325,132231,131176,130160,129178,128231,127316,126431,125575,124747,123945,123168,122416,121686,120977,120290,119622,118974,118344,117731,117135,116555]
[52,10,45,50,157939,156030,154211,152477,150821,149240,147726,146278,144890,143558,142280,141051,139870,138734,137640,136585,135568,134587,133640,132724,131840,130984,130156,129354,128577,127824,127094,126386,125698,125031,124382,123752,123140,122544,121964]
[53,11,50,55,163348,161438,159620,157885,156230,154648,153135,151686,150298,148967,147688,146460,145279,144143,143048,141994,140977,139996,139048,138133,137248,136392,135564,134762,133986,133233,132503,131794,131107,130440,129791,129161,128548,127952,127373]
[54,12,55,60,168757,166847,165028,163294,161639,160057,158544,157095,155707,154375,153097,151869,150688,149551,148457,147402,146385,145404,144457,143542,142657,141801,140973,140171,139394,138641,137911,137203,136516,135848,135200,134569,133957,133361,132781]
[55,13,60,65,174165,172256,170437,168703,167047,165465,163952,162504,161115,159784,158505,157277,156096,154960,153865,152811,151794,150813,149865,148950,148065,147210,146382,145580,144803,144050,143320,142612,141924,141257,140608,139978,139365,138770,138190]
[56,14,65,70,179574,177664,175845,174111,172456,170874,169361,167912,166524,165192,163914,162686,161505,160368,159274,158219,157203,156221,155274,154359,153474,152618,151790,150988,150212,149459,148729,148020,147333,146665,146017,145387,144774,144178,143598]
[57,15,70,75,184982,183073,181254,179520,177864,176283,174769,173321,171933,170601,169323,168094,166913,165777,164683,163628,162611,161630,160683,159767,158883,158027,157199,156397,155620,154867,154137,153429,152741,152074,151425,150795,150183,149587,149007]
[58,16,75,80,190391,188481,186663,184928,183273,181691,180178,178729,177341,176010,174731,173503,172322,171186,170091,169037,168020,167039,166091,165176,164291,163435,162607,161805,161029,160276,159546,158837,158150,157483,156834,156204,155591,154995,154416]
[59,17,80,85,195800,193890,192071,190337,188682,187100,185587,184138,182750,181418,180140,178912,177731,176594,175500,174445,173428,172447,171500,170585,169700,168844,168016,167214,166437,165684,164954,164246,163559,162891,162243,161612,161000,160404,159824]
[60,18,85,90,201208,199299,197480,195746,194090,192508,190995,189547,188158,186827,185548,184320,183139,182003,180908,179854,178837,177856,176908,175993,175108,174253,173425,172623,171846,171093,170363,169655,168967,168300,167651,167021,166408,165813,165233]
[61,19,90,95,206617,204707,202888,201154,199499,197917,196404,194955,193567,192235,190957,189729,188548,187411,186317,185262,184246,183264,182317,181402,180517,179661,178833,178031,177255,176502,175772,175063,174376,173708,173060,172430,171817,171221,170641]
[62,20,95,100,212025,210116,208297,206563,204907,203326,201812,200364,198976,197644,196366,195137,193956,192820,191726,190671,189654,188673,187726,186810,185926,185070,184242,183440,182663,181910,181180,180472,179784,179117,178468,177838,177226,176630,176050]
[63]

{"sheet":"CDF y CRT-DA","index":10,"n_rows":63,"n_cols":39,"rows_kept":63,"cut":false,"hidden":true,"merged":[[41,2,41,3]]}
[1,"CDF y CRT utilizados por el modelo"]
[2,null,null,null,null,null,"Fórmula","Estimación Proyecto"]
[3]
[4,null,null,null,null,null,"CDF + CRT",{"$f":"IF((Cálculo!$C$2/3)<5000,($H$31+'CDF y CRT-DA'!$H$35),('CDF y CRT-DA'!$H$21+$H$23))","v":168657.22737495654}]
[5]
[6]
[7]
[8]
[9]
[10]
[11]
[12]
[13]
[14,"Municipios CRA 720 de 2015",null,null,null,null,null,null,"Digestión Anaerobia"]
[15,null,null,null,null,null,"Fórmula","Estimación Proyecto"]
[16,null,null,null,null,null,"QRS",{"$f":"I16/12","v":2300},{"$f":"'Fichas técnicas Tecnologías'!$X$9*'Fichas técnicas Tecnologías'!Q9","v":27600}]
[17,null,null,null,null,null,"D",{"$f":"IF('Datos de entrada'!$B$50=\"No\",'Datos de entrada'!$B$51,'Datos de entrada'!$B$34)","v":2}]
[18,null,null,null,null,null,"CDF=CDFVU+CDFPC ($ dic 2014)",{"$f":"H19+H20","v":81823.448260869569}]
[19,null,null,null,null,null,"CDFVU ($ dic 2014)",{"$f":"MIN(18722+(132924379/$H$16), 139896)","v":76515.208260869564}]
[20,null,null,null,null,null,"CDFPC ($ dic 2014)",{"$f":"MIN(242+(11652352/$H$16),6185)","v":5308.24}]
[21,null,null,null,null,null,"Actualización CDF($ año de inicio de operaciones)",{"$f":"+H18*((1+(2.23%*('Datos de entrada'!$B$5-2014))))","v":96420.751430608696}]
[22,null,null,null,null,null,"CRT",{"$f":"64745+(738*$H$17)+(8683846/$H$16)","v":69996.585217391301}]
[23,null,null,null,null,null,"Actualización CRT($ año de inicio de operaciones)",{"$f":"$H$22*((0.89+(0.003*('Datos de entrada'!$B$5-2014)))+(0.11+(0.001*('Datos de entrada'!$B$5-2014))))","v":72236.475944347825},"Revisar formula de actualización"]
[24]
[25]
[26,"Municipios CRA 853 de 2018"]
[27]
[28,null,null,null,null,null,"QRT",{"$f":"I16/12","v":2300}]
[29,null,null,null,null,null,"D",{"$f":"IF('Datos de entrada'!$B$50=\"No\",'Datos de entrada'!$B$51,'Datos de entrada'!$B$34)","v":2}]
[30,null,null,null,null,null,"CRT ($ jul 2018)",{"$f":"IF($H$29<100,VLOOKUP($L$32,$A$43:$AM$62,$L$33,FALSE),25554+(1082*$H$29+(15659942/$H$28)))","v":73287}]
[31,null,null,null,null,null,"Actualización CRT($ año de inicio de operaciones)",{"$f":"$H$30*((0.89*(1+3%)^('Datos de entrada'!$B$5-2018))+(0.11*(1+1%)^('Datos de entrada'!$B$5-2018)))","v":81800.698169933996},{"$f":"+H31/H30","v":1.116169282}]
[32,null,null,null,null,null,"CDF=CDFVU+CDFPC ($ jul 2018)",{"$f":"+H33+H34","v":92106.768260869561},{"$f":"(I31^0.25)-1","v":2.7856570777651246E-2},null,"Fila",{"$f":"+ROW(B43)+INT(H29/5)","v":43}]
[33,null,null,null,null,null,"CDFVU ($ jul 2018)",{"$f":"MIN(21075+(149630621/$H$28), 157478)","v":86131.791739130436},null,null,"Columna",{"$f":"+IF(H28<=200,COLUMN(E41),IF(AND(H28>=200,H28<=365),COLUMN(F41)+INT((H28-200)/5),COLUMN(AM41)))","v":39},"Le inclui un condicional siendo que se salia del rango maximo"]
[34,null,null,null,null,null,"CDFPC ($ jul 2018)",{"$f":"MIN(272+(13116846/$H$28),6962)","v":5974.9765217391305}]
[35,null,null,null,null,null,"Actualización CRT($ año de inicio de operaciones)",{"$f":"+H32*((1+(2.23%*('Datos de entrada'!$B$5-2018))))","v":100322.69198973912}]
[36]
[37]
[38]
[39,1,2,3,1,2,3,4,5,6,7,8,9,10,11,12,13,14,15,16,17,18,19,20,21,22,23,24,25,29,30,31,32,33,34,35,36,37,38]
[40,null,null,null,"Ton/mes"]
[41,null,null,null,0,200,205,210,215,220,225,230,235,240,245,250,255,260,265,270,275,280,285,290,295,300,305,310,315,320,325,330,335,340,345,350,355,360,365]
[42,null,"km",null,200,205,210,215,220,225,230,235,240,245,250,255,260,265,270,275,280,285,290,295,300,305,310,315,320,325,330,335,340,345,350,355,360,365,10000000]
[43,1,0,5,109262,107352,105534,103799,102144,100562,99049,97600,96212,94881,93602,92374,91193,90056,88962,87908,86891,85910,84962,84047,83162,82306,81478,80676,79900,79147,78417,77708,77021,76354,75705,75075,74462,73866,73287]
[44,2,5,10,114671,112761,110942,109208,107553,105971,104458,103009,101621,100289,99011,97783,96602,95465,94371,93316,92299,91318,90371,89456,88571,87715,86887,86085,85308,84555,83825,83117,82430,81762,81114,80483,79871,79275,78695]
[45,3,10,15,120079,118170,116351,114617,112961,111379,109866,108418,107029,105698,104419,103191,102010,100874,99779,98725,97708,96727,95779,94864,93979,93124,92296,91494,90717,89964,89234,88526,87838,87171,86522,85892,85279,84684,84104]
[46,4,15,20,125488,123578,121759,120025,118370,116788,115275,113826,112438,111106,109828,108600,107419,106282,105188,104133,103117,102135,101188,100273,99388,98532,97704,96902,96125,95373,94643,93934,93247,92579,91931,91301,90688,90092,89512]
[47,5,20,25,130896,128987,127168,125434,123778,122197,120683,119235,117847,116515,115237,114008,112827,111691,110597,109542,108525,107544,106597,105681,104797,103941,103113,102311,101534,100781,100051,99343,98655,97988,97339,96709,96097,95501,94921]
[48,6,25,30,136305,134395,132577,130842,129187,127605,126092,124643,123255,121924,120645,119417,118236,117099,116005,114951,113934,112953,112005,111090,110205,109349,108521,107719,106943,106190,105460,104751,104064,103397,102748,102118,101505,100909,100330]
[49,7,30,35,141714,139804,137985,136251,134596,133014,131501,130052,128664,127332,126054,124826,123645,122508,121414,120359,119342,118361,117414,116499,115614,114758,113930,113128,112351,111598,110868,110160,109473,108805,108157,107526,106914,106318,105738]
[50,8,35,40,147122,145213,143394,141660,140004,138422,136909,135461,134072,132741,131462,130234,129053,127917,126822,125768,124751,123770,122822,121907,121022,120167,119339,118537,117760,117007,116277,115569,114881,114214,113565,112935,112322,111727,111147]
[51,9,40,45,152531,150621,148802,147068,145413,143831,142318,140869,139481,138149,136871,135643,134462,133325,132231,131176,130160,129178,128231,127316,126431,125575,124747,123945,123168,122416,121686,120977,120290,119622,118974,118344,117731,117135,116555]
[52,10,45,50,157939,156030,154211,152477,150821,149240,147726,146278,144890,143558,142280,141051,139870,138734,137640,136585,135568,134587,133640,132724,131840,130984,130156,129354,128577,127824,127094,126386,125698,125031,124382,123752,123140,122544,121964]
[53,11,50,55,163348,161438,159620,157885,156230,154648,153135,151686,150298,148967,147688,146460,145279,144143,143048,141994,140977,139996,139048,138133,137248,136392,135564,134762,133986,133233,132503,131794,131107,130440,129791,129161,128548,127952,127373]
[54,12,55,60,168757,166847,165028,163294,161639,160057,158544,157095,155707,154375,153097,151869,150688,149551,148457,147402,146385,145404,144457,143542,142657,141801,140973,140171,139394,138641,137911,137203,136516,135848,135200,134569,133957,133361,132781]
[55,13,60,65,174165,172256,170437,168703,167047,165465,163952,162504,161115,159784,158505,157277,156096,154960,153865,152811,151794,150813,149865,148950,148065,147210,146382,145580,144803,144050,143320,142612,141924,141257,140608,139978,139365,138770,138190]
[56,14,65,70,179574,177664,175845,174111,172456,170874,169361,167912,166524,165192,163914,162686,161505,160368,159274,158219,157203,156221,155274,154359,153474,152618,151790,150988,150212,149459,148729,148020,147333,146665,146017,145387,144774,144178,143598]
[57,15,70,75,184982,183073,181254,179520,177864,176283,174769,173321,171933,170601,169323,168094,166913,165777,164683,163628,162611,161630,160683,159767,158883,158027,157199,156397,155620,154867,154137,153429,152741,152074,151425,150795,150183,149587,149007]
[58,16,75,80,190391,188481,186663,184928,183273,181691,180178,178729,177341,176010,174731,173503,172322,171186,170091,169037,168020,167039,166091,165176,164291,163435,162607,161805,161029,160276,159546,158837,158150,157483,156834,156204,155591,154995,154416]
[59,17,80,85,195800,193890,192071,190337,188682,187100,185587,184138,182750,181418,180140,178912,177731,176594,175500,174445,173428,172447,171500,170585,169700,168844,168016,167214,166437,165684,164954,164246,163559,162891,162243,161612,161000,160404,159824]
[60,18,85,90,201208,199299,197480,195746,194090,192508,190995,189547,188158,186827,185548,184320,183139,182003,180908,179854,178837,177856,176908,175993,175108,174253,173425,172623,171846,171093,170363,169655,168967,168300,167651,167021,166408,165813,165233]
[61,19,90,95,206617,204707,202888,201154,199499,197917,196404,194955,193567,192235,190957,189729,188548,187411,186317,185262,184246,183264,182317,181402,180517,179661,178833,178031,177255,176502,175772,175063,174376,173708,173060,172430,171817,171221,170641]
[62,20,95,100,212025,210116,208297,206563,204907,203326,201812,200364,198976,197644,196366,195137,193956,192820,191726,190671,189654,188673,187726,186810,185926,185070,184242,183440,182663,181910,181180,180472,179784,179117,178468,177838,177226,176630,176050]
[63]

{"sheet":"Valoración","index":11,"n_rows":7,"n_cols":13,"rows_kept":7,"cut":false,"hidden":true,"merged":[[0,1,0,10],[0,0,1,0],[0,12,1,12],[0,11,1,11]]}
["Tecnología","Requerimientos",null,null,null,null,null,null,null,null,null,"Cantidad requerimientos","Cumplimiento requerimientos (%)"]
[null,"Escala mínima","Escala máxima","Unidad","Valoración","Contenido de humedad","Unidad","Valoración","Complejidad","Separación en la fuente","Valoración"]
["Compostaje en pilas con volteo manual",1000,200000,"tpa",{"$f":"IF(AND((Cálculo!$B$127)>=B3,(Cálculo!$B$127)<=C3),\"Adecuado\", \"No adecuado\")","v":"Adecuado"},0.5,"%",{"$f":"IF((((Cálculo!$B$127)/(Cálculo!$B$126))*'Información referencia'!$B$2)>=F3,\"Adecuado\",\"No adecuado\")","v":"No adecuado"},"Baja - Media","Alta",{"$f":"IF(Cálculo!$C$136=\"Alta\",\"Adecuado\",\"No adecuado\")","v":"No adecuado"},3,{"$f":"COUNTIF(B3:K3,\"Adecuado\")/L3","v":0.33333333333333331}]
["Compostaje en pilas con aireación forzada",1000,200000,"tpa",{"$f":"IF(AND((Cálculo!$B$127)>=B4,(Cálculo!$B$127)<=C4),\"Adecuado\", \"No adecuado\")","v":"Adecuado"},0.5,"%",{"$f":"IF((((Cálculo!$B$127)/(Cálculo!$B$126))*'Información referencia'!$B$2)>=F4,\"Adecuado\",\"No adecuado\")","v":"No adecuado"},"Baja - Media","Alta",{"$f":"IF(Cálculo!$C$136=\"Alta\",\"Adecuado\",\"No adecuado\")","v":"No adecuado"},3,{"$f":"COUNTIF(B4:K4,\"Adecuado\")/L4","v":0.33333333333333331}]
["Compostaje cerrado o \"In vessel\"",5000,300000,"tpa",{"$f":"IF(AND((Cálculo!$B$127)>=B5,(Cálculo!$B$127)<=C5),\"Adecuado\", \"No adecuado\")","v":"Adecuado"},0.5,"%",{"$f":"IF((((Cálculo!$B$127)/(Cálculo!$B$126))*'Información referencia'!$B$2)>=F5,\"Adecuado\",\"No adecuado\")","v":"No adecuado"},"Baja - Media","Alta",{"$f":"IF(Cálculo!$C$136=\"Alta\",\"Adecuado\",\"No adecuado\")","v":"No adecuado"},3,{"$f":"COUNTIF(B5:K5,\"Adecuado\")/L5","v":0.33333333333333331}]
["Tratamiento Mecánico Biológico",20000,500000,"tpa",{"$f":"IF(AND((Cálculo!$B$126)>=B6,(Cálculo!$B$127)<=C6),\"Adecuado\", \"No adecuado\")","v":"Adecuado"},0,"%",{"$f":"IF((((Cálculo!$B$127)/(Cálculo!$B$126))*'Información referencia'!$B$2)>=F6,\"Adecuado\",\"No adecuado\")","v":"Adecuado"},"Media - Alta","Baja",{"$f":"IF(OR(Cálculo!$C$136=\"Media\",Cálculo!$C$136=\"Alta\"),\"Adecuado\",\"No adecuado\")","v":"Adecuado"},3,{"$f":"COUNTIF(B6:K6,\"Adecuado\")/L6","v":1}]
["Digestión Anaerobia",20000,500000,"tpa",{"$f":"IF(AND((Cálculo!$B$127)>=B7,(Cálculo!$B$126)<=C7),\"Adecuado\", \"No adecuado\")","v":"Adecuado"},0.6,"%",{"$f":"IF((((Cálculo!$B$127)/(Cálculo!$B$126))*'Información referencia'!$B$2)>=F7,\"Adecuado\",\"No adecuado\")","v":"No adecuado"},"Media - Alta","Media",{"$f":"IF(OR(Cálculo!C136=\"Media\",Cálculo!$C$136=\"Alta\"),\"Adecuado\",\"No adecuado\")","v":"Adecuado"},3,{"$f":"COUNTIF(B7:K7,\"Adecuado\")/L7","v":0.66666666666666663}]

{"sheet":"Costos de operación","index":12,"n_rows":77,"n_cols":16,"rows_kept":77,"cut":false,"hidden":true,"merged":[[0,14,1,15],[15,14,16,15],[30,14,31,15],[45,14,46,15],[61,14,62,15],[65,3,65,11],[48,3,48,11],[61,2,61,10],[61,12,62,13],[62,3,62,4],[62,5,62,6],[62,7,62,8],[62,9,62,10],[49,3,49,11],[45,2,45,10],[45,12,46,13],[46,3,46,4],[46,5,46,6],[46,7,46,8],[46,9,46,10],[30,2,30,10],[30,12,31,13],[31,3,31,4],[31,5,31,6],[31,7,31,8],[31,9,31,10],[15,2,15,10],[15,12,16,13],[16,3,16,4],[16,5,16,6],[16,7,16,8],[16,9,16,10],[0,2,0,10],[0,12,1,13],[1,3,1,4],[1,5,1,6],[1,7,1,8],[1,9,1,10]]}
[null,1,{"$f":"+'Fichas técnicas Tecnologías'!A3","v":"Compostaje en pilas con volteo manual"},null,null,null,null,null,null,null,null,null,"Costo según mercado atendido residuos sólidos sin incluir poda, corte de cesped ni plazas de mercado",null,"Costo según mercado atendido de residuos de poda, corte de cesped y plazas de mercado"]
[null,2,"Escala (ton/mes)",38933,null,9125,null,304,null,"Funciones de costos"]
[null,3,"Componente","Valor (COP)/año","COP/Ton/año","Valor (COP)/año","COP/Ton/año","Valor (COP)/año","COP/Ton/año","a","b","Techo","COP/ton","Valor total","COP/ton","Valor total"]
[{"$f":"$C$1","v":"Compostaje en pilas con volteo manual"},4,"Energia",{"$f":"708100645*D14","v":637290580.5},{"$f":"+D4/($D$2*12)","v":1364.0754212364832},{"$f":"165961089*F14","v":157663034.54999998},{"$f":"+F4/($F$2*12)","v":1439.8450643835615},5532036,{"$f":"IFERROR(H4/($H$2*12),0)","v":1516.4572368421052},{"$f":"+E4","v":1364.0754212364832},{"$f":"+G4","v":1439.8450643835615},{"$f":"+MAX(E4,G4,I4)","v":1516.4572368421052},{"$f":"+IF('Fichas técnicas Tecnologías'!$Y$3<=$H$2*12,I4,IF(AND('Fichas técnicas Tecnologías'!$Y$3>$H$2*12,'Fichas técnicas Tecnologías'!$Y$3<=$F$2*12),G4,E4))","v":1364.0754212364832},{"$f":"ROUND('Fichas técnicas Tecnologías'!$X$3*M4,-6)","v":63000000},{"$f":"+IF('Fichas técnicas Tecnologías'!$Y$3<=$H$2*12,I4,IF(AND('Fichas técnicas Tecnologías'!$Y$3>$H$2*12,'Fichas técnicas Tecnologías'!$Y$3<=$F$2*12),G4,E4))","v":1364.0754212364832},{"$f":"IFERROR(ROUND('Fichas técnicas Tecnologías'!$Y$3*O4,-6),\"Se debe indicar cantidades en los datos de entrada\")","v":273000000}]
[null,5,"Combustible",{"$f":"2734906203*D14","v":2461415582.7000003},{"$f":"+D5/($D$2*12)","v":5268.4859945290636},{"$f":"640993641*F14","v":608943958.94999993},{"$f":"+F5/($F$2*12)","v":5561.1320452054788},21366455,{"$f":"IFERROR(H5/($H$2*12),0)","v":5857.0326206140353},5268.4859945290636,5561.1320452054788,5857.0326206140353,{"$f":"+IF('Fichas técnicas Tecnologías'!$Y$3<=$H$2*12,I5,IF(AND('Fichas técnicas Tecnologías'!$Y$3>$H$2*12,'Fichas técnicas Tecnologías'!$Y$3<=$F$2*12),G5,E5))","v":5268.4859945290636},{"$f":"ROUND('Fichas técnicas Tecnologías'!$X$3*M5,-6)","v":242000000},{"$f":"+IF('Fichas técnicas Tecnologías'!$Y$3<=$H$2*12,I5,IF(AND('Fichas técnicas Tecnologías'!$Y$3>$H$2*12,'Fichas técnicas Tecnologías'!$Y$3<=$F$2*12),G5,E5))","v":5268.4859945290636},{"$f":"IFERROR(ROUND('Fichas técnicas Tecnologías'!$Y$3*O5,-6),\"Se debe indicar cantidades en los datos de entrada\")","v":1054000000}]
[null,6,"Agua ",{"$f":"85465819*D14","v":76919237.100000009},164.64018763003111,{"$f":"20031051*F14","v":19029498.449999999},173.78537397260274,667702,183.03234649122808,164.64018763003111,173.78537397260274,183.03234649122808,{"$f":"+IF('Fichas técnicas Tecnologías'!$Y$3<=$H$2*12,I6,IF(AND('Fichas técnicas Tecnologías'!$Y$3>$H$2*12,'Fichas técnicas Tecnologías'!$Y$3<=$F$2*12),G6,E6))","v":164.64018763003111},{"$f":"ROUND('Fichas técnicas Tecnologías'!$X$3*M6,-6)","v":8000000},{"$f":"+IF('Fichas técnicas Tecnologías'!$Y$3<=$H$2*12,I6,IF(AND('Fichas técnicas Tecnologías'!$Y$3>$H$2*12,'Fichas técnicas Tecnologías'!$Y$3<=$F$2*12),G6,E6))","v":164.64018763003111},{"$f":"IFERROR(ROUND('Fichas técnicas Tecnologías'!$Y$3*O6,-6),\"Se debe indicar cantidades en los datos de entrada\")","v":33000000}]
[null,7,"Tratamiento RSO",{"$f":"9157052019*D14","v":8241346817.1000004},17640.020071019444,{"$f":"2146184067*F14","v":2038874863.6499999},18619.861768493149,{"$f":"+G7*H2*12","v":67925255.731463015},18619.861768493152,17640.020071019444,18619.861768493149,18619.861768493152,{"$f":"+IF('Fichas técnicas Tecnologías'!$Y$3<=$H$2*12,I7,IF(AND('Fichas técnicas Tecnologías'!$Y$3>$H$2*12,'Fichas técnicas Tecnologías'!$Y$3<=$F$2*12),G7,E7))","v":17640.020071019444},{"$f":"ROUND('Fichas técnicas Tecnologías'!$X$3*M7,-6)","v":811000000},{"$f":"+IF('Fichas técnicas Tecnologías'!$Y$3<=$H$2*12,I7,IF(AND('Fichas técnicas Tecnologías'!$Y$3>$H$2*12,'Fichas técnicas Tecnologías'!$Y$3<=$F$2*12),G7,E7))","v":17640.020071019444},{"$f":"IFERROR(ROUND('Fichas técnicas Tecnologías'!$Y$3*O7,-6),\"Se debe indicar cantidades en los datos de entrada\")","v":3528000000}]
[null,8,"Monitoreo Ambiental ",45000000,96.31931780237845,31359767,286.39056621004568,7839942,2149.1069078947367,96.31931780237845,286.39056621004568,2149.1069078947367,{"$f":"+IF('Fichas técnicas Tecnologías'!$Y$3<=$H$2*12,I8,IF(AND('Fichas técnicas Tecnologías'!$Y$3>$H$2*12,'Fichas técnicas Tecnologías'!$Y$3<=$F$2*12),G8,E8))","v":96.31931780237845},{"$f":"ROUND('Fichas técnicas Tecnologías'!$X$3*M8,-6)","v":4000000},{"$f":"+IF('Fichas técnicas Tecnologías'!$Y$3<=$H$2*12,I8,IF(AND('Fichas técnicas Tecnologías'!$Y$3>$H$2*12,'Fichas técnicas Tecnologías'!$Y$3<=$F$2*12),G8,E8))","v":96.31931780237845},{"$f":"IFERROR(ROUND('Fichas técnicas Tecnologías'!$Y$3*O8,-6),\"Se debe indicar cantidades en los datos de entrada\")","v":19000000}]
[null,9,"Mantenimiento - Maquinaria y equipos ",{"$f":"345828645*D14","v":311245780.5},666.19958325841833,{"$f":"165791431*F14","v":157501859.44999999},1438.3731456621003,13754548,3770.4353070175439,666.19958325841833,1438.3731456621003,3770.4353070175439,{"$f":"+IF('Fichas técnicas Tecnologías'!$Y$3<=$H$2*12,I9,IF(AND('Fichas técnicas Tecnologías'!$Y$3>$H$2*12,'Fichas técnicas Tecnologías'!$Y$3<=$F$2*12),G9,E9))","v":666.19958325841833},{"$f":"ROUND('Fichas técnicas Tecnologías'!$X$3*M9,-6)","v":31000000},{"$f":"+IF('Fichas técnicas Tecnologías'!$Y$3<=$H$2*12,I9,IF(AND('Fichas técnicas Tecnologías'!$Y$3>$H$2*12,'Fichas técnicas Tecnologías'!$Y$3<=$F$2*12),G9,E9))","v":666.19958325841833},{"$f":"IFERROR(ROUND('Fichas técnicas Tecnologías'!$Y$3*O9,-6),\"Se debe indicar cantidades en los datos de entrada\")","v":133000000}]
[null,10,"Mantenimiento - Infraestructura ",{"$f":"406980090*D14","v":366282081},784.00089255901162,{"$f":"124636727*F14","v":118404890.64999999},1081.323202283105,4154558,1138.859100877193,784.00089255901162,1081.323202283105,{"$f":"+MAX(E10,G10,I10)","v":1138.859100877193},{"$f":"+IF('Fichas técnicas Tecnologías'!$Y$3<=$H$2*12,I10,IF(AND('Fichas técnicas Tecnologías'!$Y$3>$H$2*12,'Fichas técnicas Tecnologías'!$Y$3<=$F$2*12),G10,E10))","v":784.00089255901162},{"$f":"ROUND('Fichas técnicas Tecnologías'!$X$3*M10,-6)","v":36000000},{"$f":"+IF('Fichas técnicas Tecnologías'!$Y$3<=$H$2*12,I10,IF(AND('Fichas técnicas Tecnologías'!$Y$3>$H$2*12,'Fichas técnicas Tecnologías'!$Y$3<=$F$2*12),G10,E10))","v":784.00089255901162},{"$f":"IFERROR(ROUND('Fichas técnicas Tecnologías'!$Y$3*O10,-6),\"Se debe indicar cantidades en los datos de entrada\")","v":157000000}]
[null,11,"Mano de Obra",576133411,1233.1728246817181,199882140,1825.4076712328767,12959852,3552.5910087719299,1233.1728246817181,1825.4076712328767,{"$f":"+MAX(E11,G11,I11)","v":3552.5910087719299},{"$f":"+IF('Fichas técnicas Tecnologías'!$Y$3<=$H$2*12,I11,IF(AND('Fichas técnicas Tecnologías'!$Y$3>$H$2*12,'Fichas técnicas Tecnologías'!$Y$3<=$F$2*12),G11,E11))","v":1233.1728246817181},{"$f":"ROUND('Fichas técnicas Tecnologías'!$X$3*M11,-6)","v":57000000},{"$f":"+IF('Fichas técnicas Tecnologías'!$Y$3<=$H$2*12,I11,IF(AND('Fichas técnicas Tecnologías'!$Y$3>$H$2*12,'Fichas técnicas Tecnologías'!$Y$3<=$F$2*12),G11,E11))","v":1233.1728246817181},{"$f":"IFERROR(ROUND('Fichas técnicas Tecnologías'!$Y$3*O11,-6),\"Se debe indicar cantidades en los datos de entrada\")","v":247000000}]
[null,12,"Valor de Operación Anual",{"$f":"SUM(D4:D11)","v":12715633489.900002},null,{"$f":"SUM(F4:F11)","v":3331660012.6999998},null,{"$f":"SUM(H4:H11)","v":134200348.73146302},null,null,null,null,null,{"$f":"SUM(N4:N11)","v":1252000000},null,{"$f":"SUM(P4:P11)","v":5444000000}]
[null,13]
[null,14,null,0.9,null,0.95,{"$f":"+F2*12","v":109500},null,{"$f":"+H2*12","v":3648}]
[null,15]
[null,16,{"$f":"+'Fichas técnicas Tecnologías'!A4","v":"Compostaje en pilas con aireación forzada"},null,null,null,null,null,null,null,null,null,"Costo según mercado atendido residuos sólidos sin incluir poda, corte de cesped ni plazas de mercado",null,"Costo según mercado atendido de residuos de poda, corte de cesped y plazas de mercado"]
[null,17,"Escala (ton/mes)",38933,null,9125,null,304,null,"Funciones de costos"]
[null,18,"Componente","Valor (COP)/año","COP/Ton/año","Valor (COP)/año","COP/Ton/año","Valor (COP)/año","COP/Ton/año","a","b","Techo","COP/ton","Valor total","COP/ton","Valor total"]
[{"$f":"+$C$16","v":"Compostaje en pilas con aireación forzada"},19,"Energia",{"$f":"757667690*D29","v":681900921},{"$f":"+D19/($D$17*12)","v":1459.5607004340791},{"$f":"177578365*F29","v":168699446.75},{"$f":"+F19/($F$17*12)","v":1540.6342168949773},5919279,{"$f":"IFERROR(H19/($H$17*12),0)","v":1622.609375},{"$f":"+E19","v":1459.5607004340791},{"$f":"+G19","v":1540.6342168949773},{"$f":"+MAX(E19,G19,I19)","v":1622.609375},{"$f":"+IF('Fichas técnicas Tecnologías'!$Y$3<=$H$2*12,I19,IF(AND('Fichas técnicas Tecnologías'!$Y$3>$H$2*12,'Fichas técnicas Tecnologías'!$Y$3<=$F$2*12),G19,E19))","v":1459.5607004340791},{"$f":"ROUND('Fichas técnicas Tecnologías'!$X$4*M19,-6)","v":67000000},{"$f":"+IF('Fichas técnicas Tecnologías'!$Y$3<=$H$2*12,I19,IF(AND('Fichas técnicas Tecnologías'!$Y$3>$H$2*12,'Fichas técnicas Tecnologías'!$Y$3<=$F$2*12),G19,E19))","v":1459.5607004340791},{"$f":"IFERROR(ROUND('Fichas técnicas Tecnologías'!$Y$4*O19,-6),\"Se debe indicar cantidades en los datos de entrada\")","v":292000000}]
[null,20,"Combustible",{"$f":"2926349637*D29","v":2633714673.3000002},{"$f":"+D20/($D$17*12)","v":5637.2800137415561},{"$f":"685863196*F29","v":651570036.19999993},{"$f":"+F20/($F$17*12)","v":5950.4112894977161},22862107,{"$f":"IFERROR(H20/($H$17*12),0)","v":6267.0249451754389},5637.2800137415561,5950.4112894977161,{"$f":"+MAX(E20,G20,I20)","v":6267.0249451754389},{"$f":"+IF('Fichas técnicas Tecnologías'!$Y$3<=$H$2*12,I20,IF(AND('Fichas técnicas Tecnologías'!$Y$3>$H$2*12,'Fichas técnicas Tecnologías'!$Y$3<=$F$2*12),G20,E20))","v":5637.2800137415561},{"$f":"ROUND('Fichas técnicas Tecnologías'!$X$4*M20,-6)","v":259000000},{"$f":"+IF('Fichas técnicas Tecnologías'!$Y$3<=$H$2*12,I20,IF(AND('Fichas técnicas Tecnologías'!$Y$3>$H$2*12,'Fichas técnicas Tecnologías'!$Y$3<=$F$2*12),G20,E20))","v":5637.2800137415561},{"$f":"IFERROR(ROUND('Fichas técnicas Tecnologías'!$Y$4*O20,-6),\"Se debe indicar cantidades en los datos de entrada\")","v":1127000000}]
[null,21,"Agua ",{"$f":"91448426*D29","v":82303583.400000006},176.16500012842576,21433225,195.73721461187213,714441,195.84457236842104,176.16500012842576,195.73721461187213,195.84457236842104,{"$f":"+IF('Fichas técnicas Tecnologías'!$Y$3<=$H$2*12,I21,IF(AND('Fichas técnicas Tecnologías'!$Y$3>$H$2*12,'Fichas técnicas Tecnologías'!$Y$3<=$F$2*12),G21,E21))","v":176.16500012842576},{"$f":"ROUND('Fichas técnicas Tecnologías'!$X$4*M21,-6)","v":8000000},{"$f":"+IF('Fichas técnicas Tecnologías'!$Y$3<=$H$2*12,I21,IF(AND('Fichas técnicas Tecnologías'!$Y$3>$H$2*12,'Fichas técnicas Tecnologías'!$Y$3<=$F$2*12),G21,E21))","v":176.16500012842576},{"$f":"IFERROR(ROUND('Fichas técnicas Tecnologías'!$Y$4*O21,-6),\"Se debe indicar cantidades en los datos de entrada\")","v":35000000}]
[null,22,"Tratamiento RSO",{"$f":"9798045660*D29","v":8818241094},18874.821475355096,2296416952,20971.844310502282,76505288.044712335,20971.844310502285,18874.821475355096,20971.844310502282,20971.844310502285,{"$f":"+IF('Fichas técnicas Tecnologías'!$Y$3<=$H$2*12,I22,IF(AND('Fichas técnicas Tecnologías'!$Y$3>$H$2*12,'Fichas técnicas Tecnologías'!$Y$3<=$F$2*12),G22,E22))","v":18874.821475355096},{"$f":"ROUND('Fichas técnicas Tecnologías'!$X$4*M22,-6)","v":868000000},{"$f":"+IF('Fichas técnicas Tecnologías'!$Y$3<=$H$2*12,I22,IF(AND('Fichas técnicas Tecnologías'!$Y$3>$H$2*12,'Fichas técnicas Tecnologías'!$Y$3<=$F$2*12),G22,E22))","v":18874.821475355096},{"$f":"IFERROR(ROUND('Fichas técnicas Tecnologías'!$Y$4*O22,-6),\"Se debe indicar cantidades en los datos de entrada\")","v":3775000000}]
[null,23,"Monitoreo Ambiental ",45000000,96.31931780237845,33554951,306.43790867579906,8388738,2299.5444078947367,96.31931780237845,306.43790867579906,2299.5444078947367,{"$f":"+IF('Fichas técnicas Tecnologías'!$Y$3<=$H$2*12,I23,IF(AND('Fichas técnicas Tecnologías'!$Y$3>$H$2*12,'Fichas técnicas Tecnologías'!$Y$3<=$F$2*12),G23,E23))","v":96.31931780237845},{"$f":"ROUND('Fichas técnicas Tecnologías'!$X$4*M23,-6)","v":4000000},{"$f":"+IF('Fichas técnicas Tecnologías'!$Y$3<=$H$2*12,I23,IF(AND('Fichas técnicas Tecnologías'!$Y$3>$H$2*12,'Fichas técnicas Tecnologías'!$Y$3<=$F$2*12),G23,E23))","v":96.31931780237845},{"$f":"IFERROR(ROUND('Fichas técnicas Tecnologías'!$Y$4*O23,-6),\"Se debe indicar cantidades en los datos de entrada\")","v":19000000}]
[null,24,"Mantenimiento - Maquinaria y equipos ",{"$f":"370036650*D29","v":333032985},712.8335537975496,177396832,1620.0623926940639,14717367,4034.3659539473683,712.8335537975496,1620.0623926940639,4034.3659539473683,{"$f":"+IF('Fichas técnicas Tecnologías'!$Y$3<=$H$2*12,I24,IF(AND('Fichas técnicas Tecnologías'!$Y$3>$H$2*12,'Fichas técnicas Tecnologías'!$Y$3<=$F$2*12),G24,E24))","v":712.8335537975496},{"$f":"ROUND('Fichas técnicas Tecnologías'!$X$4*M24,-6)","v":33000000},{"$f":"+IF('Fichas técnicas Tecnologías'!$Y$3<=$H$2*12,I24,IF(AND('Fichas técnicas Tecnologías'!$Y$3>$H$2*12,'Fichas técnicas Tecnologías'!$Y$3<=$F$2*12),G24,E24))","v":712.8335537975496},{"$f":"IFERROR(ROUND('Fichas técnicas Tecnologías'!$Y$4*O24,-6),\"Se debe indicar cantidades en los datos de entrada\")","v":143000000}]
[null,25,"Mantenimiento - Infraestructura ",{"$f":"608838780*D29","v":547954902},1172.8587188246474,142696589,1303.165196347032,4756553,1303.8796600877192,1172.8587188246474,1303.165196347032,1303.8796600877192,{"$f":"+IF('Fichas técnicas Tecnologías'!$Y$3<=$H$2*12,I25,IF(AND('Fichas técnicas Tecnologías'!$Y$3>$H$2*12,'Fichas técnicas Tecnologías'!$Y$3<=$F$2*12),G25,E25))","v":1172.8587188246474},{"$f":"ROUND('Fichas técnicas Tecnologías'!$X$4*M25,-6)","v":54000000},{"$f":"+IF('Fichas técnicas Tecnologías'!$Y$3<=$H$2*12,I25,IF(AND('Fichas técnicas Tecnologías'!$Y$3>$H$2*12,'Fichas técnicas Tecnologías'!$Y$3<=$F$2*12),G25,E25))","v":1172.8587188246474},{"$f":"IFERROR(ROUND('Fichas técnicas Tecnologías'!$Y$4*O25,-6),\"Se debe indicar cantidades en los datos de entrada\")","v":235000000}]
[null,26,"Mano de Obra",576133411,{"$f":"+D26/($D$2*12)","v":1233.1728246817181},199882140,{"$f":"+F26/($F$2*12)","v":1825.4076712328767},12959852,{"$f":"IFERROR(H26/($H$2*12),0)","v":3552.5910087719299},1233.1728246817181,1825.4076712328767,3552.5910087719299,{"$f":"+IF('Fichas técnicas Tecnologías'!$Y$3<=$H$2*12,I26,IF(AND('Fichas técnicas Tecnologías'!$Y$3>$H$2*12,'Fichas técnicas Tecnologías'!$Y$3<=$F$2*12),G26,E26))","v":1233.1728246817181},{"$f":"ROUND('Fichas técnicas Tecnologías'!$X$4*M26,-6)","v":57000000},{"$f":"+IF('Fichas técnicas Tecnologías'!$Y$3<=$H$2*12,I26,IF(AND('Fichas técnicas Tecnologías'!$Y$3>$H$2*12,'Fichas técnicas Tecnologías'!$Y$3<=$F$2*12),G26,E26))","v":1233.1728246817181},{"$f":"IFERROR(ROUND('Fichas técnicas Tecnologías'!$Y$4*O26,-6),\"Se debe indicar cantidades en los datos de entrada\")","v":247000000}]
[null,27,"Valor de Operación Anual",{"$f":"SUM(D19:D26)","v":13718281569.700001},null,null,null,null,null,null,null,null,null,{"$f":"SUM(N19:N26)","v":1350000000},null,{"$f":"SUM(P19:P26)","v":5873000000}]
[null,28]
[null,29,null,0.9,null,0.95]
[null,30]
[null,31,{"$f":"+'Fichas técnicas Tecnologías'!A5","v":"Compostaje cerrado o \"In vessel\""},null,null,null,null,null,null,null,null,null,"Costo según mercado atendido residuos sólidos sin incluir poda, corte de cesped ni plazas de mercado",null,"Costo según mercado atendido de residuos de poda, corte de cesped y plazas de mercado"]
[null,32,"Escala (ton/mes)",38933,null,9125,null,304,null,"Funciones de costos"]
[null,33,"Componente","Valor (COP)/año","COP/Ton","Valor (COP)/año","COP/Ton","Valor (COP)/año","COP/Ton","a","b","Techo","COP/ton","Valor total","COP/ton","Valor total"]
[{"$f":"+$C$31","v":"Compostaje cerrado o \"In vessel\""},34,"Energia",{"$f":"6104701346*D43","v":5494231211.4000006},{"$f":"+D34/($D$32*12)","v":11760.013380679631},{"$f":"1430789378*F43","v":1359249909.0999999},{"$f":"+F34/($F$32*12)","v":12413.241178995433},47692979,{"$f":"IFERROR(H34/($H$32*12),0)","v":13073.733278508771},{"$f":"+E34","v":11760.013380679631},{"$f":"+G34","v":12413.241178995433},{"$f":"+MAX(E34,G34,I34)","v":13073.733278508771},{"$f":"+IF('Fichas técnicas Tecnologías'!$Y$3<=$H$2*12,I34,IF(AND('Fichas técnicas Tecnologías'!$Y$3>$H$2*12,'Fichas técnicas Tecnologías'!$Y$3<=$F$2*12),G34,E34))","v":11760.013380679631},{"$f":"ROUND('Fichas técnicas Tecnologías'!$X$5*M34,-6)","v":541000000}]
[null,35,"Combustible",{"$f":"100422337*D43","v":90380103.299999997},193.45221983921095,{"$f":"8584736*F43","v":8155499.1999999993},74.479444748858441,286158,78.442434210526315,193.45221983921095,74.479444748858441,{"$f":"+MAX(E35,G35,I35)","v":193.45221983921095},{"$f":"+IF('Fichas técnicas Tecnologías'!$Y$3<=$H$2*12,I35,IF(AND('Fichas técnicas Tecnologías'!$Y$3>$H$2*12,'Fichas técnicas Tecnologías'!$Y$3<=$F$2*12),G35,E35))","v":193.45221983921095},{"$f":"ROUND('Fichas técnicas Tecnologías'!$X$5*M35,-6)","v":9000000}]
[null,36,"Agua ",{"$f":"100422337*D43","v":90380103.299999997},193.45221983921095,{"$f":"23536485*F43","v":22359660.75},204.19781506849316,784550,215.06304824561403,193.45221983921095,204.19781506849316,215.06304824561403,{"$f":"+IF('Fichas técnicas Tecnologías'!$Y$3<=$H$2*12,I36,IF(AND('Fichas técnicas Tecnologías'!$Y$3>$H$2*12,'Fichas técnicas Tecnologías'!$Y$3<=$F$2*12),G36,E36))","v":193.45221983921095},{"$f":"ROUND('Fichas técnicas Tecnologías'!$X$5*M36,-6)","v":9000000}]
[null,37,"Tratamiento RSO",{"$f":"4214884792*D43","v":3793396312.8000002},8119.4965556211955,{"$f":"987863623*F43","v":938470441.8499999},8570.5063182648391,32928787,9026.5315241228072,8119.4965556211955,8570.5063182648391,9026.5315241228072,{"$f":"+IF('Fichas técnicas Tecnologías'!$Y$3<=$H$2*12,I37,IF(AND('Fichas técnicas Tecnologías'!$Y$3>$H$2*12,'Fichas técnicas Tecnologías'!$Y$3<=$F$2*12),G37,E37))","v":8119.4965556211955},{"$f":"ROUND('Fichas técnicas Tecnologías'!$X$5*M37,-6)","v":373000000}]
[null,38,"Monitoreo Ambiental ",45000000,96.31931780237845,31359767,286.39056621004568,15679884,{"$f":"IFERROR(H38/($H$32*12),0)","v":4298.2138157894733},96.31931780237845,286.39056621004568,4298.2138157894733,{"$f":"+IF('Fichas técnicas Tecnologías'!$Y$3<=$H$2*12,I38,IF(AND('Fichas técnicas Tecnologías'!$Y$3>$H$2*12,'Fichas técnicas Tecnologías'!$Y$3<=$F$2*12),G38,E38))","v":96.31931780237845},{"$f":"ROUND('Fichas técnicas Tecnologías'!$X$5*M38,-6)","v":4000000}]
[null,39,"Mantenimiento - Infraestructura ",{"$f":"4629052334*D43","v":4166147100.5999999},8917.3432576477535,{"$f":"1159152680*F43","v":1101195046},10056.575762557077,47105699,12912.74643640351,8917.3432576477535,10056.575762557077,12912.74643640351,{"$f":"+IF('Fichas técnicas Tecnologías'!$Y$3<=$H$2*12,I39,IF(AND('Fichas técnicas Tecnologías'!$Y$3>$H$2*12,'Fichas técnicas Tecnologías'!$Y$3<=$F$2*12),G39,E39))","v":8917.3432576477535},{"$f":"ROUND('Fichas técnicas Tecnologías'!$X$5*M39,-6)","v":410000000}]
[null,40,"Mano de Obra",1225072508.0816059,{"$f":"+D40/($D$2*12)","v":2622.1810719304231},748895482.051373,{"$f":"+F40/($F$2*12)","v":6839.2281465878814},404548929.72626078,{"$f":"IFERROR(H40/($H$2*12),0)","v":110896.0881925057},2622.1810719304231,6839.2281465878814,110896.0881925057,{"$f":"+IF('Fichas técnicas Tecnologías'!$Y$3<=$H$2*12,I40,IF(AND('Fichas técnicas Tecnologías'!$Y$3>$H$2*12,'Fichas técnicas Tecnologías'!$Y$3<=$F$2*12),G40,E40))","v":2622.1810719304231},{"$f":"ROUND('Fichas técnicas Tecnologías'!$X$5*M40,-6)","v":121000000}]
[null,41,"Valor de Operación Anual",null,null,null,null,null,null,null,null,null,{"$f":"+IF('Fichas técnicas Tecnologías'!$Y$3<=$H$2*12,I41,IF(AND('Fichas técnicas Tecnologías'!$Y$3>$H$2*12,'Fichas técnicas Tecnologías'!$Y$3<=$F$2*12),G41,E41))","v":0},{"$f":"SUM(N34:N39)","v":1346000000}]
[null,42]
[null,43,null,0.9,null,0.95]
[null,44]
[null,45]
[null,46,{"$f":"+'Fichas técnicas Tecnologías'!A6","v":"Tratamiento Mecánico Biológico"},null,null,null,null,null,null,null,null,null,"Costo según mercado atendido residuos sólidos sin incluir poda, corte de cesped ni plazas de mercado",null,"Costo según mercado atendido de residuos de poda, corte de cesped y plazas de mercado"]
[null,47,"Escala (ton/mes)",38933,null,9125,null,304,null,"Funciones de costos"]
[null,48,"Componente","Valor (COP)/año","COP/Ton/año","Valor (COP)/año","COP/Ton/año","Valor (COP)/año","COP/Ton/año","a","b","Techo","COP/ton","Valor total","COP/ton","Valor total"]
[{"$f":"+$C$46","v":"Tratamiento Mecánico Biológico"},49,"Disposición final de rechazos diferentes a residuos que van a otro tratamiento","CALCULADO A PARTIR DE LOS COSTOS DE RECOLECCIÓN Y TRANSPORTE (CRT) Y DE DISPOSICIÓN FINAL (CDF) DE LAS METODOLOGÍAS TARIFARIAS",null,null,null,null,null,null,null,null,{"$f":"'CDF y CRT-TMB'!$H$4","v":221118.91604392539},{"$f":"ROUND('Fichas técnicas Tecnologías'!$X$6*M49*((1-'Fichas técnicas Tecnologías'!S6)+(1-'Fichas técnicas Tecnologías'!S7)-('Fichas técnicas Tecnologías'!S8)),-6)","v":3560000000}]
[null,50,"Tratamiento RSO (compostaje aireación forzada)","CALCULADO A PARTIR DEL COSTO DE LA TECNOLOGÍA INDICADA",null,null,null,null,null,null,null,null,{"$f":"+$M$22","v":18874.821475355096},{"$f":"ROUND('Fichas técnicas Tecnologías'!$X$6*M50,-6)","v":868000000}]
[null,51,"Combustible",{"$f":"1220940269*D59","v":1098846242.1000001},{"$f":"+D51/($D$47*12)","v":2352.0026757506489},{"$f":"286157876*F59","v":271849982.19999999},{"$f":"+F51/($F$47*12)","v":2482.6482392694061},9538596,{"$f":"IFERROR(H51/($H$47*12),0)","v":2614.7467105263158},{"$f":"+E51","v":2352.0026757506489},{"$f":"+G51","v":2482.6482392694061},{"$f":"+MAX(E51,G51,I51)","v":2614.7467105263158},{"$f":"+IF('Fichas técnicas Tecnologías'!$Y$3<=$H$2*12,I51,IF(AND('Fichas técnicas Tecnologías'!$Y$3>$H$2*12,'Fichas técnicas Tecnologías'!$Y$3<=$F$2*12),G51,E51))","v":2352.0026757506489},{"$f":"ROUND('Fichas técnicas Tecnologías'!$X$6*M51,-6)","v":108000000}]
[null,52,"Energía (consumo)",{"$f":"3371907834*D59","v":3034717050.5999999},6495.5972452675105,{"$f":"790290898*F59","v":750776353.10000002},6856.4050511415526,8781010,2407.0751096491226,{"$f":"+E52","v":6495.5972452675105},{"$f":"+G52","v":6856.4050511415526},{"$f":"+MAX(E52,G52,I52)","v":6856.4050511415526},{"$f":"+IF('Fichas técnicas Tecnologías'!$Y$3<=$H$2*12,I52,IF(AND('Fichas técnicas Tecnologías'!$Y$3>$H$2*12,'Fichas técnicas Tecnologías'!$Y$3<=$F$2*12),G52,E52))","v":6495.5972452675105},{"$f":"ROUND('Fichas técnicas Tecnologías'!$X$6*M52,-6)","v":299000000}]
[null,53,"Monitoreo Ambiental",45000000,96.31931780237845,31359767,286.39056621004568,15679884,4298.2138157894733,96.31931780237845,286.39056621004568,4298.2138157894733,{"$f":"+IF('Fichas técnicas Tecnologías'!$Y$3<=$H$2*12,I53,IF(AND('Fichas técnicas Tecnologías'!$Y$3>$H$2*12,'Fichas técnicas Tecnologías'!$Y$3<=$F$2*12),G53,E53))","v":96.31931780237845},{"$f":"ROUND('Fichas técnicas Tecnologías'!$X$6*M53,-6)","v":4000000}]
[null,54,"Mantenimiento - Maquinaria y equipos ",{"$f":"333111219*D59","v":299800097.10000002},641.70090732797371,{"$f":"200478583*F59","v":190454653.84999999},1739.3119073059361,7224196,1980.3168859649122,641.70090732797371,1739.3119073059361,1980.3168859649122,{"$f":"+IF('Fichas técnicas Tecnologías'!$Y$3<=$H$2*12,I54,IF(AND('Fichas técnicas Tecnologías'!$Y$3>$H$2*12,'Fichas técnicas Tecnologías'!$Y$3<=$F$2*12),G54,E54))","v":641.70090732797371},{"$f":"ROUND('Fichas técnicas Tecnologías'!$X$6*M54,-6)","v":30000000}]
[null,55,"Mantenimiento - Infraestructura ",{"$f":"107686132*D59","v":96917518.799999997},207.44509542033751,{"$f":"25238937*F59","v":23976990.149999999},218.96794657534244,841298,230.61896929824562,207.44509542033751,218.96794657534244,230.61896929824562,{"$f":"+IF('Fichas técnicas Tecnologías'!$Y$3<=$H$2*12,I55,IF(AND('Fichas técnicas Tecnologías'!$Y$3>$H$2*12,'Fichas técnicas Tecnologías'!$Y$3<=$F$2*12),G55,E55))","v":207.44509542033751},{"$f":"ROUND('Fichas técnicas Tecnologías'!$X$6*M55,-6)","v":10000000}]
[null,56,"Mano de Obra",2306697560.1686411,{"$f":"+D56/($D$2*12)","v":4937.3230082634291},1678126133.6060271,{"$f":"+F56/($F$2*12)","v":15325.352818319883},132972780.76663788,{"$f":"IFERROR(H56/($H$2*12),0)","v":36450.871920679245},4937.3230082634291,15325.352818319883,36450.871920679245,{"$f":"+IF('Fichas técnicas Tecnologías'!$Y$3<=$H$2*12,I56,IF(AND('Fichas técnicas Tecnologías'!$Y$3>$H$2*12,'Fichas técnicas Tecnologías'!$Y$3<=$F$2*12),G56,E56))","v":4937.3230082634291},{"$f":"ROUND('Fichas técnicas Tecnologías'!$X$6*M56,-6)","v":227000000}]
[null,57,"Valor de Operación Anual",null,null,null,null,null,null,null,null,null,{"$f":"+IF('Fichas técnicas Tecnologías'!$Y$3<=$H$2*12,I57,IF(AND('Fichas técnicas Tecnologías'!$Y$3>$H$2*12,'Fichas técnicas Tecnologías'!$Y$3<=$F$2*12),G57,E57))","v":0},{"$f":"SUM(N49:N55)","v":4879000000}]
[null,58]
[null,59,null,0.9,null,0.95]
[null,60]
[null,61]
[null,62,{"$f":"+'Fichas técnicas Tecnologías'!A9","v":"Digestión Anaerobia"},null,null,null,null,null,null,null,null,null,"Costo según mercado atendido residuos sólidos sin incluir poda, corte de cesped ni plazas de mercado",null,"Costo según mercado atendido de residuos de poda, corte de cesped y plazas de mercado"]
[null,63,"Escala (ton/mes)",38933,null,9125,null,304,null,"Funciones de costos"]
[null,64,"Componente","Valor (COP)/año","COP/Ton/año","Valor (COP)/año","COP/Ton/año","Valor (COP)/año","COP/Ton/año","a","b","Techo","COP/ton","Valor total","COP/ton","Valor total"]
[{"$f":"+$C$62","v":"Digestión Anaerobia"},65,"Agua Residual",{"$f":"610470135*D75","v":549423121.5},{"$f":"+D65/($D$63*12)","v":1176.0013388385175},{"$f":"143078938*F75","v":135924991.09999999},{"$f":"+F65/($F$63*12)","v":1241.324119634703},31359767,{"$f":"IFERROR(H65/($H$63*12*20),0)","v":429.821367872807},{"$f":"+E65","v":1176.0013388385175},{"$f":"+G65","v":1241.324119634703},{"$f":"+MAX(E65,G65,I65)","v":1241.324119634703},{"$f":"+IF('Fichas técnicas Tecnologías'!$Y$3<=$H$2*12,I65,IF(AND('Fichas técnicas Tecnologías'!$Y$3>$H$2*12,'Fichas técnicas Tecnologías'!$Y$3<=$F$2*12),G65,E65))","v":1176.0013388385175},{"$f":"ROUND('Fichas técnicas Tecnologías'!$X$9*M65,-6)","v":54000000}]
[null,66,"Tratamiento RSO","CALCULADO A PARTIR DE LOS COSTOS DE RECOLECCIÓN Y TRANSPORTE (CRT) Y DE DISPOSICIÓN FINAL (CDF) DE LAS METODOLOGÍAS TARIFARIAS",null,null,null,null,null,null,null,null,{"$f":"'CDF y CRT-DA'!$H$4","v":168657.22737495654},{"$f":"ROUND('Fichas técnicas Tecnologías'!$X$9*M66*'Fichas técnicas Tecnologías'!Q9,-6)","v":4655000000}]
[null,67,"Agua (consumo)",{"$f":"42732909*D75","v":38459618.100000001},{"$f":"+D67/($D$63*12)","v":82.320092851822366},{"$f":"10015526*F75","v":9514749.6999999993},{"$f":"+F67/($F$63*12)","v":86.892691324200911},2195184,{"$f":"IFERROR(H67/($H$63*12*20),0)","v":30.087499999999999},{"$f":"+E67","v":82.320092851822366},{"$f":"+G67","v":86.892691324200911},{"$f":"+MAX(E67,G67,I67)","v":86.892691324200911},{"$f":"+IF('Fichas técnicas Tecnologías'!$Y$3<=$H$2*12,I67,IF(AND('Fichas técnicas Tecnologías'!$Y$3>$H$2*12,'Fichas técnicas Tecnologías'!$Y$3<=$F$2*12),G67,E67))","v":82.320092851822366},{"$f":"ROUND('Fichas técnicas Tecnologías'!$X$9*M67,-6)","v":4000000}]
[null,68,"Monitoreo Ambiental",45000000,{"$f":"+D68/($D$63*12)","v":96.31931780237845},31359767,{"$f":"+F68/($F$63*12)","v":286.39056621004568},15679884,{"$f":"IFERROR(H68/($H$63*12*20),0)","v":214.91069078947368},96.31931780237845,286.39056621004568,286.39056621004568,{"$f":"+IF('Fichas técnicas Tecnologías'!$Y$3<=$H$2*12,I68,IF(AND('Fichas técnicas Tecnologías'!$Y$3>$H$2*12,'Fichas técnicas Tecnologías'!$Y$3<=$F$2*12),G68,E68))","v":96.31931780237845},{"$f":"ROUND('Fichas técnicas Tecnologías'!$X$9*M68,-6)","v":4000000}]
[null,69,"Mantenimiento - Maquinaria y equipos",{"$f":"7710048300*D75","v":6939043470},{"$f":"+D69/($D$63*12)","v":14852.531849587753},{"$f":"1993356567*F75","v":1893688738.6499999},{"$f":"+F69/($F$63*12)","v":17293.961083561644},518157800,{"$f":"IFERROR(H69/($H$63*12*20),0)","v":7101.9435307017548},14852.531849587753,17293.961083561644,17293.961083561644,{"$f":"+IF('Fichas técnicas Tecnologías'!$Y$3<=$H$2*12,I69,IF(AND('Fichas técnicas Tecnologías'!$Y$3>$H$2*12,'Fichas técnicas Tecnologías'!$Y$3<=$F$2*12),G69,E69))","v":14852.531849587753},{"$f":"ROUND('Fichas técnicas Tecnologías'!$X$9*M69,-6)","v":683000000}]
[null,70,"Mantenimiento - Infraestructura ",{"$f":"358953774*D75","v":323058396.60000002},{"$f":"+D70/($D$63*12)","v":691.48365268538259},{"$f":"168259582*F75","v":159846602.90000001},{"$f":"+F70/($F$63*12)","v":1459.7863278538814},46098516,{"$f":"IFERROR(H70/($H$63*12*20),0)","v":631.83273026315794},691.48365268538259,1459.7863278538814,1459.7863278538814,{"$f":"+IF('Fichas técnicas Tecnologías'!$Y$3<=$H$2*12,I70,IF(AND('Fichas técnicas Tecnologías'!$Y$3>$H$2*12,'Fichas técnicas Tecnologías'!$Y$3<=$F$2*12),G70,E70))","v":691.48365268538259},{"$f":"ROUND('Fichas técnicas Tecnologías'!$X$9*M70,-6)","v":32000000}]
[null,71,"Energía (consumo)",{"$f":"3371907834*1.5","v":5057861751},{"$f":"+D71/($D$47*12)","v":10825.995408779185},{"$f":"790290898*1.5","v":1185436347},{"$f":"+F71/($F$47*12)","v":10825.902712328767},87810101.5,{"$f":"IFERROR(H71/($H$47*12),0)","v":24070.751507675439},10825.995408779185,10825.902712328767,24070.751507675439,{"$f":"+IF('Fichas técnicas Tecnologías'!$Y$3<=$H$2*12,I71,IF(AND('Fichas técnicas Tecnologías'!$Y$3>$H$2*12,'Fichas técnicas Tecnologías'!$Y$3<=$F$2*12),G71,E71))","v":10825.995408779185},{"$f":"ROUND('Fichas técnicas Tecnologías'!$X$9*M71,-6)","v":498000000}]
[null,72,"Mano de Obra",1472750904.0367501,{"$f":"+D72/($D$2*12)","v":3152.3191637701311},1177532222.1710465,{"$f":"+F72/($F$2*12)","v":10753.718923936498},882313540.30533838,{"$f":"IFERROR(H72/($H$2*12),0)","v":241862.26433808618},3152.3191637701311,10753.718923936498,241862.26433808618,{"$f":"+IF('Fichas técnicas Tecnologías'!$Y$3<=$H$2*12,I72,IF(AND('Fichas técnicas Tecnologías'!$Y$3>$H$2*12,'Fichas técnicas Tecnologías'!$Y$3<=$F$2*12),G72,E72))","v":3152.3191637701311},{"$f":"ROUND('Fichas técnicas Tecnologías'!$X$9*M72,-6)","v":145000000}]
[null,73,"Valor de Operación Anual",null,null,null,null,null,null,null,null,null,null,{"$f":"SUM(N65:N72)","v":6075000000}]
[null,74]
[null,75,null,0.9,null,0.95]
[null,76,null,null,null,null,null,null,null,null,null,null,null,{"$f":"+N66/N73","v":0.76625514403292183}]
[null,77]

{"sheet":"Costos de inversión","index":13,"n_rows":413,"n_cols":16,"rows_kept":413,"cut":false,"hidden":true,"merged":[[0,14,1,15],[20,14,21,15],[39,14,40,15],[59,14,60,15],[78,14,79,15],[78,2,78,10],[78,12,79,13],[79,3,79,4],[79,5,79,6],[79,7,79,8],[79,9,79,10],[59,2,59,10],[59,12,60,13],[60,3,60,4],[60,5,60,6],[60,7,60,8],[60,9,60,10],[39,2,39,10],[39,12,40,13],[40,3,40,4],[40,9,40,10],[20,2,20,10],[20,12,21,13],[21,3,21,4],[21,9,21,10],[21,5,21,6],[40,7,40,8],[40,5,40,6],[21,7,21,8],[1,9,1,10],[0,2,0,10],[1,3,1,4],[0,12,1,13],[1,5,1,6],[1,7,1,8]]}
[null,1,{"$f":"+'Fichas técnicas Tecnologías'!A3","v":"Compostaje en pilas con volteo manual"},null,null,null,null,null,null,null,null,null,"Costo según mercado atendido residuos sólidos sin incluir poda, corte de cesped ni plazas de mercado",null,"Costo según mercado atendido de residuos de poda, corte de cesped y plazas de mercado"]
[null,{"$f":"B1+1","v":2},"Escala (ton/mes)",38933,null,9125,null,304,null,"Funciones de costos"]
[null,{"$f":"B2+1","v":3},"Componentes","Valor (COP)","COP/Ton ","Valor (COP)","COP/Ton ","Valor (COP)","COP/Ton ","a","b","Techo","COP/ton","Valor total","COP/ton","Valor total"]
[{"$f":"$C$1","v":"Compostaje en pilas con volteo manual"},4,"Pre-inversión"]
[null,5,"   Estudios, Diseños ",873399584,{"$f":"+D5/($D$2*12)","v":1869.4500466613583},299277561,{"$f":"+F5/($F$2*12)","v":2733.1284109589042},40601853,{"$f":"IFERROR(H25/($H$2*12),0)","v":12742.615679824561},{"$f":"+E5","v":1869.4500466613583},{"$f":"+G5","v":2733.1284109589042},{"$f":"+MAX(E5,G5,I5)","v":12742.615679824561},{"$f":"+IF('Fichas técnicas Tecnologías'!$X$3<=$H$2*12,I5,IF(AND('Fichas técnicas Tecnologías'!$X$3>$H$2*12,'Fichas técnicas Tecnologías'!$X$3<=$F$2*12),G5,E5))","v":2733.1284109589042},{"$f":"ROUND('Fichas técnicas Tecnologías'!$X$3*M5,-6)","v":126000000},{"$f":"+IF('Fichas técnicas Tecnologías'!$Y$3<=$H$2*12,I5,IF(AND('Fichas técnicas Tecnologías'!$Y$3>$H$2*12,'Fichas técnicas Tecnologías'!$Y$3<=$F$2*12),G5,E5))","v":1869.4500466613583},{"$f":"IFERROR(ROUND('Fichas técnicas Tecnologías'!$Y$3*O5,-6),\"Se debe indicar cantidades en los datos de entrada\")","v":374000000}]
[null,6,"   Permisos",200000000,{"$f":"+D6/($D$2*12)","v":428.08585689945977},149638781,{"$f":"+F6/($F$2*12)","v":1366.5642100456621},20300927,{"$f":"IFERROR(H26/($H$2*12),0)","v":6371.3078399122805},{"$f":"+E6","v":428.08585689945977},{"$f":"+G6","v":1366.5642100456621},{"$f":"+MAX(E6,G6,I6)","v":6371.3078399122805},{"$f":"+IF('Fichas técnicas Tecnologías'!$X$3<=$H$2*12,I6,IF(AND('Fichas técnicas Tecnologías'!$X$3>$H$2*12,'Fichas técnicas Tecnologías'!$X$3<=$F$2*12),G6,E6))","v":1366.5642100456621},{"$f":"ROUND('Fichas técnicas Tecnologías'!$X$3*M6,-6)","v":63000000},{"$f":"+IF('Fichas técnicas Tecnologías'!$Y$3<=$H$2*12,I6,IF(AND('Fichas técnicas Tecnologías'!$Y$3>$H$2*12,'Fichas técnicas Tecnologías'!$Y$3<=$F$2*12),G6,E6))","v":428.08585689945977},{"$f":"IFERROR(ROUND('Fichas técnicas Tecnologías'!$Y$3*O6,-6),\"Se debe indicar cantidades en los datos de entrada\")","v":86000000}]
[null,7,"Infraestructura",40698008973,{"$f":"+D7/($D$2*12)","v":87111.210226543029},9538595853,{"$f":"+F7/($F$2*12)","v":87110.464410958899},317953195,{"$f":"IFERROR(H27/($H$2*12),0)","v":93259.297971491222},{"$f":"+E7","v":87111.210226543029},{"$f":"+G7","v":87110.464410958899},{"$f":"+MAX(E7,G7,I7)","v":93259.297971491222},{"$f":"+IF('Fichas técnicas Tecnologías'!$X$3<=$H$2*12,I7,IF(AND('Fichas técnicas Tecnologías'!$X$3>$H$2*12,'Fichas técnicas Tecnologías'!$X$3<=$F$2*12),G7,E7))","v":87110.464410958899},{"$f":"ROUND('Fichas técnicas Tecnologías'!$X$3*M7,-6)","v":4007000000},{"$f":"+IF('Fichas técnicas Tecnologías'!$Y$3<=$H$2*12,I7,IF(AND('Fichas técnicas Tecnologías'!$Y$3>$H$2*12,'Fichas técnicas Tecnologías'!$Y$3<=$F$2*12),G7,E7))","v":87111.210226543029},{"$f":"IFERROR(ROUND('Fichas técnicas Tecnologías'!$Y$3*O7,-6),\"Se debe indicar cantidades en los datos de entrada\")","v":17422000000}]
[null,8,"Maquinaria y Equipos (incluido el costo de instalación)"]
[null,9,"   Trommel",1345846222,{"$f":"+D9/($D$2*12)","v":2880.6886659988527},336461555,{"$f":"+F9/($F$2*12)","v":3072.7082648401824},168230778,{"$f":"IFERROR(H29/($H$2*12),0)","v":49344.005482456138},{"$f":"+E9","v":2880.6886659988527},{"$f":"+G9","v":3072.7082648401824},{"$f":"+MAX(E9,G9,I9)","v":49344.005482456138},{"$f":"+IF('Fichas técnicas Tecnologías'!$X$3<=$H$2*12,I9,IF(AND('Fichas técnicas Tecnologías'!$X$3>$H$2*12,'Fichas técnicas Tecnologías'!$X$3<=$F$2*12),G9,E9))","v":3072.7082648401824},{"$f":"ROUND('Fichas técnicas Tecnologías'!$X$3*M9,-6)","v":141000000},{"$f":"+IF('Fichas técnicas Tecnologías'!$Y$3<=$H$2*12,I9,IF(AND('Fichas técnicas Tecnologías'!$Y$3>$H$2*12,'Fichas técnicas Tecnologías'!$Y$3<=$F$2*12),G9,E9))","v":2880.6886659988527},{"$f":"IFERROR(ROUND('Fichas técnicas Tecnologías'!$Y$3*O9,-6),\"Se debe indicar cantidades en los datos de entrada\")","v":576000000}]
[null,10,"   Minicargador",488689705,1046.0057556143461,244344853,2231.4598447488584,244344853,{"$f":"IFERROR(H30/($H$2*12),0)","v":71669.131578947374},null,null,null,{"$f":"+N10/'Fichas técnicas Tecnologías'!$X$3","v":5311.8446304347826},{"$f":"IF('Fichas técnicas Tecnologías'!$X$3<=$H$2*12,H10,IF(AND('Fichas técnicas Tecnologías'!$X$3>$H$2*12,'Fichas técnicas Tecnologías'!$X$3<=$F$2*12),F10,D10))","v":244344853},{"$f":"IF('Fichas técnicas Tecnologías'!$Y$3*Cálculo!$B$130>=$F$2,IF(L10=0,J10+K10/'Fichas técnicas Tecnologías'!$Y$3*Cálculo!$B$130,MIN(L10,J10+K10/'Fichas técnicas Tecnologías'!$Y$3*Cálculo!$B$130)), MIN(L10,J10+K10/'Fichas técnicas Tecnologías'!$Y$3*Cálculo!$B$130))","v":0},{"$f":"IF('Fichas técnicas Tecnologías'!$Y$3<=$H$2*12,H10,IF(AND('Fichas técnicas Tecnologías'!$Y$3>$H$2*12,'Fichas técnicas Tecnologías'!$Y$3<=$F$2*12),F10,D10))","v":488689705}]
[null,11,"   Tractor",488689705,1046.0057556143461,244344853,2231.4598447488584,0,{"$f":"IFERROR(H31/($H$2*Cálculo!$B$130),0)","v":0},null,null,null,{"$f":"+N11/'Fichas técnicas Tecnologías'!$X$3","v":5311.8446304347826},{"$f":"IF('Fichas técnicas Tecnologías'!$X$3<=$H$2*12,H11,IF(AND('Fichas técnicas Tecnologías'!$X$3>$H$2*12,'Fichas técnicas Tecnologías'!$X$3<=$F$2*12),F11,D11))","v":244344853},{"$f":"IF('Fichas técnicas Tecnologías'!$Y$3*Cálculo!$B$130>=$F$2,IF(L11=0,J11+K11/'Fichas técnicas Tecnologías'!$Y$3*Cálculo!$B$130,MIN(L11,J11+K11/'Fichas técnicas Tecnologías'!$Y$3*Cálculo!$B$130)), MIN(L11,J11+K11/'Fichas técnicas Tecnologías'!$Y$3*Cálculo!$B$130))","v":0},{"$f":"IF('Fichas técnicas Tecnologías'!$Y$3<=$H$2*12,H11,IF(AND('Fichas técnicas Tecnologías'!$Y$3>$H$2*12,'Fichas técnicas Tecnologías'!$Y$3<=$F$2*12),F11,D11))","v":488689705}]
[null,12,"   Retroexcavadora",425970171,911.759028330722,212985085,1945.0692694063928,0,{"$f":"IFERROR(H32/($H$2*Cálculo!$B$130),0)","v":0},null,null,null,{"$f":"+N12/'Fichas técnicas Tecnologías'!$X$3","v":4630.1105434782612},{"$f":"IF('Fichas técnicas Tecnologías'!$X$3<=$H$2*12,H12,IF(AND('Fichas técnicas Tecnologías'!$X$3>$H$2*12,'Fichas técnicas Tecnologías'!$X$3<=$F$2*12),F12,D12))","v":212985085},{"$f":"IF('Fichas técnicas Tecnologías'!$Y$3*Cálculo!$B$130>=$F$2,IF(L12=0,J12+K12/'Fichas técnicas Tecnologías'!$Y$3*Cálculo!$B$130,MIN(L12,J12+K12/'Fichas técnicas Tecnologías'!$Y$3*Cálculo!$B$130)), MIN(L12,J12+K12/'Fichas técnicas Tecnologías'!$Y$3*Cálculo!$B$130))","v":0},{"$f":"IF('Fichas técnicas Tecnologías'!$Y$3<=$H$2*12,H12,IF(AND('Fichas técnicas Tecnologías'!$Y$3>$H$2*12,'Fichas técnicas Tecnologías'!$Y$3<=$F$2*12),F12,D12))","v":425970171}]
[null,13,"   Montacargas",{"$f":"+F13*2","v":303144416},648.85918543823152,151572208,1384.2210776255708,0,{"$f":"IFERROR(H33/($H$2*Cálculo!$B$130),0)","v":0},null,null,null,{"$f":"+N13/'Fichas técnicas Tecnologías'!$X$3","v":3295.0479999999998},{"$f":"IF('Fichas técnicas Tecnologías'!$X$3<=$H$2*12,H13,IF(AND('Fichas técnicas Tecnologías'!$X$3>$H$2*12,'Fichas técnicas Tecnologías'!$X$3<=$F$2*12),F13,D13))","v":151572208},{"$f":"IF('Fichas técnicas Tecnologías'!$Y$3*Cálculo!$B$130>=$F$2,IF(L13=0,J13+K13/'Fichas técnicas Tecnologías'!$Y$3*Cálculo!$B$130,MIN(L13,J13+K13/'Fichas técnicas Tecnologías'!$Y$3*Cálculo!$B$130)), MIN(L13,J13+K13/'Fichas técnicas Tecnologías'!$Y$3*Cálculo!$B$130))","v":0},{"$f":"IF('Fichas técnicas Tecnologías'!$Y$3<=$H$2*12,H13,IF(AND('Fichas técnicas Tecnologías'!$Y$3>$H$2*12,'Fichas técnicas Tecnologías'!$Y$3<=$F$2*12),F13,D13))","v":303144416}]
[null,14,"   Planta electrica",{"$f":"+F14*2","v":287464532},615.29750254711087,143732266,1312.6234337899543,143732266,{"$f":"IFERROR(H34/($H$2*12),0)","v":42158.312774122809},null,null,null,{"$f":"+N14/'Fichas técnicas Tecnologías'!$X$3","v":3124.6144782608694},{"$f":"IF('Fichas técnicas Tecnologías'!$X$3<=$H$2*12,H14,IF(AND('Fichas técnicas Tecnologías'!$X$3>$H$2*12,'Fichas técnicas Tecnologías'!$X$3<=$F$2*12),F14,D14))","v":143732266},{"$f":"IF('Fichas técnicas Tecnologías'!$Y$3*Cálculo!$B$130>=$F$2,IF(L14=0,J14+K14/'Fichas técnicas Tecnologías'!$Y$3*Cálculo!$B$130,MIN(L14,J14+K14/'Fichas técnicas Tecnologías'!$Y$3*Cálculo!$B$130)), MIN(L14,J14+K14/'Fichas técnicas Tecnologías'!$Y$3*Cálculo!$B$130))","v":0},{"$f":"IF('Fichas técnicas Tecnologías'!$Y$3<=$H$2*12,H14,IF(AND('Fichas técnicas Tecnologías'!$Y$3>$H$2*12,'Fichas técnicas Tecnologías'!$Y$3<=$F$2*12),F14,D14))","v":287464532}]
[null,15,"   Compresor",{"$f":"+F15*2","v":70559476},151.02756872918434,35279738,322.18938812785387,35279738,{"$f":"IFERROR(H35/($H$2*12),0)","v":10347.94956140351},null,null,null,{"$f":"+N15/'Fichas técnicas Tecnologías'!$X$3","v":766.95082608695657},{"$f":"IF('Fichas técnicas Tecnologías'!$X$3<=$H$2*12,H15,IF(AND('Fichas técnicas Tecnologías'!$X$3>$H$2*12,'Fichas técnicas Tecnologías'!$X$3<=$F$2*12),F15,D15))","v":35279738},{"$f":"IF('Fichas técnicas Tecnologías'!$Y$3*Cálculo!$B$130>=$F$2,IF(L15=0,J15+K15/'Fichas técnicas Tecnologías'!$Y$3*Cálculo!$B$130,MIN(L15,J15+K15/'Fichas técnicas Tecnologías'!$Y$3*Cálculo!$B$130)), MIN(L15,J15+K15/'Fichas técnicas Tecnologías'!$Y$3*Cálculo!$B$130))","v":0},{"$f":"IF('Fichas técnicas Tecnologías'!$Y$3<=$H$2*12,H15,IF(AND('Fichas técnicas Tecnologías'!$Y$3>$H$2*12,'Fichas técnicas Tecnologías'!$Y$3<=$F$2*12),F15,D15))","v":70559476}]
[null,16,"   Volqueta",862393598,1845.892511922191,574929065,5250.4937442922374,287464533,{"$f":"IFERROR(H36/($H$2*12),0)","v":84316.625548245618},null,null,null,{"$f":"+N16/'Fichas técnicas Tecnologías'!$X$3","v":12498.457934782609},{"$f":"IF('Fichas técnicas Tecnologías'!$X$3<=$H$2*12,H16,IF(AND('Fichas técnicas Tecnologías'!$X$3>$H$2*12,'Fichas técnicas Tecnologías'!$X$3<=$F$2*12),F16,D16))","v":574929065},{"$f":"IF('Fichas técnicas Tecnologías'!$Y$3*Cálculo!$B$130>=$F$2,IF(L16=0,J16+K16/'Fichas técnicas Tecnologías'!$Y$3*Cálculo!$B$130,MIN(L16,J16+K16/'Fichas técnicas Tecnologías'!$Y$3*Cálculo!$B$130)), MIN(L16,J16+K16/'Fichas técnicas Tecnologías'!$Y$3*Cálculo!$B$130))","v":0},{"$f":"IF('Fichas técnicas Tecnologías'!$Y$3<=$H$2*12,H16,IF(AND('Fichas técnicas Tecnologías'!$Y$3>$H$2*12,'Fichas técnicas Tecnologías'!$Y$3<=$F$2*12),F16,D16))","v":862393598}]
[null,17,"Total Costo de Inversión Inicial",null,null,null,null,null,null,null,null,null,null,{"$f":"SUM(N5:N16)","v":5944188068},null,{"$f":"SUM(P5:P16)","v":21384911603}]
[null,18]
[null,19]
[null,20]
[null,21,{"$f":"+'Fichas técnicas Tecnologías'!A4","v":"Compostaje en pilas con aireación forzada"},null,null,null,null,null,null,null,null,null,"Costo según mercado atendido residuos sólidos sin incluir poda, corte de cesped ni plazas de mercado",null,"Costo según mercado atendido de residuos de poda, corte de cesped y plazas de mercado"]
[null,22,"Escala (ton/mes)",38933,null,9125,null,304,null,"Funciones de costos"]
[null,23,"Componentes","Valor (COP)","COP/Ton ","Valor (COP)","COP/Ton ","Valor (COP)","COP/Ton ","a","b","Techo","COP/ton","Valor total","COP/ton","Valor total"]
[{"$f":"$C$21","v":"Compostaje en pilas con aireación forzada"},24,"Pre-inversión"]
[null,25,"   Estudios, Diseños ",{"$f":"+(D27+SUM(D29:D37))*5%","v":2427296925.5},{"$f":"+D25/($D$22*12)","v":5195.4574215104585},{"$f":"+(F27+SUM(F29:F37))*5%","v":629035140.39999998},{"$f":"+F25/($F$22*12)","v":5744.6131543378997},46485062,{"$f":"IFERROR(H25/($H$22*12),0)","v":12742.615679824561},{"$f":"+E25","v":5195.4574215104585},{"$f":"+G25","v":5744.6131543378997},{"$f":"+MAX(E25,G25,I25)","v":12742.615679824561},{"$f":"+IF('Fichas técnicas Tecnologías'!$X$3<=$H$2*12,I25,IF(AND('Fichas técnicas Tecnologías'!$X$3>$H$2*12,'Fichas técnicas Tecnologías'!$X$3<=$F$2*12),G25,E25))","v":5744.6131543378997},{"$f":"ROUND('Fichas técnicas Tecnologías'!$X$4*M25,-6)","v":264000000},{"$f":"+IF('Fichas técnicas Tecnologías'!$Y$3<=$H$2*12,I25,IF(AND('Fichas técnicas Tecnologías'!$Y$3>$H$2*12,'Fichas técnicas Tecnologías'!$Y$3<=$F$2*12),G25,E25))","v":5195.4574215104585},{"$f":"IFERROR(ROUND('Fichas técnicas Tecnologías'!$Y$4*O25,-6),\"Se debe indicar cantidades en los datos de entrada\")","v":1039000000}]
[null,26,"   Permisos",200000000,{"$f":"+D26/($D$22*12)","v":428.08585689945977},171321440,{"$f":"+F26/($F$22*12)","v":1564.5793607305936},23242531,{"$f":"IFERROR(H26/($H$22*12),0)","v":6371.3078399122805},428.08585689945977,1564.5793607305936,{"$f":"+MAX(E26,G26,I26)","v":6371.3078399122805},{"$f":"+IF('Fichas técnicas Tecnologías'!$X$3<=$H$2*12,I26,IF(AND('Fichas técnicas Tecnologías'!$X$3>$H$2*12,'Fichas técnicas Tecnologías'!$X$3<=$F$2*12),G26,E26))","v":1564.5793607305936},{"$f":"ROUND('Fichas técnicas Tecnologías'!$X$4*M26,-6)","v":72000000},{"$f":"+IF('Fichas técnicas Tecnologías'!$Y$3<=$H$2*12,I26,IF(AND('Fichas técnicas Tecnologías'!$Y$3>$H$2*12,'Fichas técnicas Tecnologías'!$Y$3<=$F$2*12),G26,E26))","v":428.08585689945977},{"$f":"IFERROR(ROUND('Fichas técnicas Tecnologías'!$Y$4*O26,-6),\"Se debe indicar cantidades en los datos de entrada\")","v":86000000}]
[null,27,"Infraestructura",43546869601,{"$f":"+D27/($D$22*12)","v":93208.994942165606},10206297563,{"$f":"+F27/($F$22*12)","v":93208.196922374424},340209919,{"$f":"IFERROR(H27/($H$22*12),0)","v":93259.297971491222},{"$f":"+E27","v":93208.994942165606},{"$f":"+G27","v":93208.196922374424},{"$f":"+MAX(E27,G27,I27)","v":93259.297971491222},{"$f":"+IF('Fichas técnicas Tecnologías'!$X$3<=$H$2*12,I27,IF(AND('Fichas técnicas Tecnologías'!$X$3>$H$2*12,'Fichas técnicas Tecnologías'!$X$3<=$F$2*12),G27,E27))","v":93208.196922374424},{"$f":"ROUND('Fichas técnicas Tecnologías'!$X$4*M27,-6)","v":4288000000},{"$f":"+IF('Fichas técnicas Tecnologías'!$Y$3<=$H$2*12,I27,IF(AND('Fichas técnicas Tecnologías'!$Y$3>$H$2*12,'Fichas técnicas Tecnologías'!$Y$3<=$F$2*12),G27,E27))","v":93208.994942165606},{"$f":"IFERROR(ROUND('Fichas técnicas Tecnologías'!$Y$4*O27,-6),\"Se debe indicar cantidades en los datos de entrada\")","v":18642000000}]
[null,28,"Maquinaria y Equipos (incluido el costo de instalación)"]
[null,29,"   Trommel",1440055457,{"$f":"+D29/($D$22*12)","v":3082.3368714629405},360013864,{"$f":"+F29/($F$22*12)","v":3287.7978447488586},180006932,{"$f":"IFERROR(H29/($H$22*12),0)","v":49344.005482456138},{"$f":"+E29","v":3082.3368714629405},{"$f":"+G29","v":3287.7978447488586},{"$f":"+MAX(E29,G29,I29)","v":49344.005482456138},{"$f":"+IF('Fichas técnicas Tecnologías'!$X$3<=$H$2*12,I29,IF(AND('Fichas técnicas Tecnologías'!$X$3>$H$2*12,'Fichas técnicas Tecnologías'!$X$3<=$F$2*12),G29,E29))","v":3287.7978447488586},{"$f":"ROUND('Fichas técnicas Tecnologías'!$X$4*M29,-6)","v":151000000},{"$f":"+IF('Fichas técnicas Tecnologías'!$Y$3<=$H$2*12,I29,IF(AND('Fichas técnicas Tecnologías'!$Y$3>$H$2*12,'Fichas técnicas Tecnologías'!$Y$3<=$F$2*12),G29,E29))","v":3082.3368714629405},{"$f":"IFERROR(ROUND('Fichas técnicas Tecnologías'!$Y$4*O29,-6),\"Se debe indicar cantidades en los datos de entrada\")","v":616000000}]
[null,30,"   Minicargador",522897985,1119.2261598986292,261448992,2387.6620273972603,261448992,{"$f":"IFERROR(H30/($H$22*12),0)","v":71669.131578947374},null,null,null,{"$f":"+N30/'Fichas técnicas Tecnologías'!$X$4","v":5683.673739130435},{"$f":"IF('Fichas técnicas Tecnologías'!$X$4<=$H$22*12,H30,IF(AND('Fichas técnicas Tecnologías'!$X$4>$H$22*12,'Fichas técnicas Tecnologías'!$X$4<=$F$22*12),F30,D30))","v":261448992},{"$f":"IF('Fichas técnicas Tecnologías'!$Y$4*Cálculo!$B$130>=$F$22,IF(L30=0,J30+K30/'Fichas técnicas Tecnologías'!$Y$4*Cálculo!$B$130,MIN(L30,J30+K30/'Fichas técnicas Tecnologías'!$Y$4*Cálculo!$B$130)), MIN(L30,J30+K30/'Fichas técnicas Tecnologías'!$Y$4*Cálculo!$B$130))","v":0},{"$f":"IF('Fichas técnicas Tecnologías'!$Y$3<=$H$2*12,H30,IF(AND('Fichas técnicas Tecnologías'!$Y$3>$H$2*12,'Fichas técnicas Tecnologías'!$Y$3<=$F$2*12),F30,D30))","v":522897985}]
[null,31,"   Tractor",522897985,1119.2261598986292,261448992,2387.6620273972603," $ -  ",{"$f":"IFERROR(H31/($H$22*Cálculo!$B$130),0)","v":0},null,null,null,{"$f":"+N31/'Fichas técnicas Tecnologías'!$X$4","v":5683.673739130435},{"$f":"IF('Fichas técnicas Tecnologías'!$X$4<=$H$22*12,H31,IF(AND('Fichas técnicas Tecnologías'!$X$4>$H$22*12,'Fichas técnicas Tecnologías'!$X$4<=$F$22*12),F31,D31))","v":261448992},{"$f":"IF('Fichas técnicas Tecnologías'!$Y$4*Cálculo!$B$130>=$F$22,IF(L31=0,J31+K31/'Fichas técnicas Tecnologías'!$Y$4*Cálculo!$B$130,MIN(L31,J31+K31/'Fichas técnicas Tecnologías'!$Y$4*Cálculo!$B$130)), MIN(L31,J31+K31/'Fichas técnicas Tecnologías'!$Y$4*Cálculo!$B$130))","v":0},{"$f":"IF('Fichas técnicas Tecnologías'!$Y$3<=$H$2*12,H31,IF(AND('Fichas técnicas Tecnologías'!$Y$3>$H$2*12,'Fichas técnicas Tecnologías'!$Y$3<=$F$2*12),F31,D31))","v":522897985}]
[null,32,"   Retroexcavadora",455788083,975.5821603780854,227894041,2081.2241187214613," $ -  ",{"$f":"IFERROR(H32/($H$22*Cálculo!$B$130),0)","v":0},null,null,null,{"$f":"+N32/'Fichas técnicas Tecnologías'!$X$4","v":4954.2182826086955},{"$f":"IF('Fichas técnicas Tecnologías'!$X$4<=$H$22*12,H32,IF(AND('Fichas técnicas Tecnologías'!$X$4>$H$22*12,'Fichas técnicas Tecnologías'!$X$4<=$F$22*12),F32,D32))","v":227894041},{"$f":"IF('Fichas técnicas Tecnologías'!$Y$4*Cálculo!$B$130>=$F$22,IF(L32=0,J32+K32/'Fichas técnicas Tecnologías'!$Y$4*Cálculo!$B$130,MIN(L32,J32+K32/'Fichas técnicas Tecnologías'!$Y$4*Cálculo!$B$130)), MIN(L32,J32+K32/'Fichas técnicas Tecnologías'!$Y$4*Cálculo!$B$130))","v":0},{"$f":"IF('Fichas técnicas Tecnologías'!$Y$3<=$H$2*12,H32,IF(AND('Fichas técnicas Tecnologías'!$Y$3>$H$2*12,'Fichas técnicas Tecnologías'!$Y$3<=$F$2*12),F32,D32))","v":455788083}]
[null,33,"   Montacargas",162182263,347.13966515124275,162182263,1481.1165570776257," $ -  ",{"$f":"IFERROR(H33/($H$22*Cálculo!$B$130),0)","v":0},null,null,null,{"$f":"+N33/'Fichas técnicas Tecnologías'!$X$4","v":3525.7013695652172},{"$f":"IF('Fichas técnicas Tecnologías'!$X$4<=$H$22*12,H33,IF(AND('Fichas técnicas Tecnologías'!$X$4>$H$22*12,'Fichas técnicas Tecnologías'!$X$4<=$F$22*12),F33,D33))","v":162182263},{"$f":"IF('Fichas técnicas Tecnologías'!$Y$4*Cálculo!$B$130>=$F$22,IF(L33=0,J33+K33/'Fichas técnicas Tecnologías'!$Y$4*Cálculo!$B$130,MIN(L33,J33+K33/'Fichas técnicas Tecnologías'!$Y$4*Cálculo!$B$130)), MIN(L33,J33+K33/'Fichas técnicas Tecnologías'!$Y$4*Cálculo!$B$130))","v":0},{"$f":"IF('Fichas técnicas Tecnologías'!$Y$3<=$H$2*12,H33,IF(AND('Fichas técnicas Tecnologías'!$Y$3>$H$2*12,'Fichas técnicas Tecnologías'!$Y$3<=$F$2*12),F33,D33))","v":162182263}]
[null,34,"   Planta electrica",{"$f":"153793525*4","v":615174100},1316.7366587042698,{"$f":"153793525*2","v":307587050},2809.0141552511413,153793525,{"$f":"IFERROR(H34/($H$22*12),0)","v":42158.312774122809},null,null,null,{"$f":"+N34/'Fichas técnicas Tecnologías'!$X$4","v":6686.6750000000002},{"$f":"IF('Fichas técnicas Tecnologías'!$X$4<=$H$22*12,H34,IF(AND('Fichas técnicas Tecnologías'!$X$4>$H$22*12,'Fichas técnicas Tecnologías'!$X$4<=$F$22*12),F34,D34))","v":307587050},{"$f":"IF('Fichas técnicas Tecnologías'!$Y$4*Cálculo!$B$130>=$F$22,IF(L34=0,J34+K34/'Fichas técnicas Tecnologías'!$Y$4*Cálculo!$B$130,MIN(L34,J34+K34/'Fichas técnicas Tecnologías'!$Y$4*Cálculo!$B$130)), MIN(L34,J34+K34/'Fichas técnicas Tecnologías'!$Y$4*Cálculo!$B$130))","v":0},{"$f":"IF('Fichas técnicas Tecnologías'!$Y$3<=$H$2*12,H34,IF(AND('Fichas técnicas Tecnologías'!$Y$3>$H$2*12,'Fichas técnicas Tecnologías'!$Y$3<=$F$2*12),F34,D34))","v":615174100}]
[null,35,"   Compresor",{"$f":"37749320*4","v":150997280},323.19899999143826,{"$f":"37749320*2","v":75498640},689.485296803653,37749320,10347.94956140351,null,null,null,{"$f":"+N35/'Fichas técnicas Tecnologías'!$X$4","v":1641.2747826086957},{"$f":"IF('Fichas técnicas Tecnologías'!$X$4<=$H$22*12,H35,IF(AND('Fichas técnicas Tecnologías'!$X$4>$H$22*12,'Fichas técnicas Tecnologías'!$X$4<=$F$22*12),F35,D35))","v":75498640},{"$f":"IF('Fichas técnicas Tecnologías'!$Y$4*Cálculo!$B$130>=$F$22,IF(L35=0,J35+K35/'Fichas técnicas Tecnologías'!$Y$4*Cálculo!$B$130,MIN(L35,J35+K35/'Fichas técnicas Tecnologías'!$Y$4*Cálculo!$B$130)), MIN(L35,J35+K35/'Fichas técnicas Tecnologías'!$Y$4*Cálculo!$B$130))","v":0},{"$f":"IF('Fichas técnicas Tecnologías'!$Y$3<=$H$2*12,H35,IF(AND('Fichas técnicas Tecnologías'!$Y$3>$H$2*12,'Fichas técnicas Tecnologías'!$Y$3<=$F$2*12),F35,D35))","v":150997280}]
[null,36,"   Volqueta",922761150,1975.1049880564046,615174100,5618.0283105022827,307587050,84316.625548245618,null,null,null,{"$f":"+N36/'Fichas técnicas Tecnologías'!$X$4","v":13373.35},{"$f":"IF('Fichas técnicas Tecnologías'!$X$4<=$H$22*12,H36,IF(AND('Fichas técnicas Tecnologías'!$X$4>$H$22*12,'Fichas técnicas Tecnologías'!$X$4<=$F$22*12),F36,D36))","v":615174100},{"$f":"IF('Fichas técnicas Tecnologías'!$Y$4*Cálculo!$B$130>=$F$22,IF(L36=0,J36+K36/'Fichas técnicas Tecnologías'!$Y$4*Cálculo!$B$130,MIN(L36,J36+K36/'Fichas técnicas Tecnologías'!$Y$4*Cálculo!$B$130)), MIN(L36,J36+K36/'Fichas técnicas Tecnologías'!$Y$4*Cálculo!$B$130))","v":0},{"$f":"IF('Fichas técnicas Tecnologías'!$Y$3<=$H$2*12,H36,IF(AND('Fichas técnicas Tecnologías'!$Y$3>$H$2*12,'Fichas técnicas Tecnologías'!$Y$3<=$F$2*12),F36,D36))","v":922761150}]
[null,37,"   Báscula de pesaje",206314606,441.60182450192212,103157303,942.07582648401831," $ -  ",{"$f":"IFERROR(H37/($H$22*Cálculo!$B$130),0)","v":0},null,null,null,{"$f":"+N37/'Fichas técnicas Tecnologías'!$X$4","v":2242.5500652173914},{"$f":"IF('Fichas técnicas Tecnologías'!$X$4<=$H$22*12,H37,IF(AND('Fichas técnicas Tecnologías'!$X$4>$H$22*12,'Fichas técnicas Tecnologías'!$X$4<=$F$22*12),F37,D37))","v":103157303},{"$f":"IF('Fichas técnicas Tecnologías'!$Y$4*Cálculo!$B$130>=$F$22,IF(L37=0,J37+K37/'Fichas técnicas Tecnologías'!$Y$4*Cálculo!$B$130,MIN(L37,J37+K37/'Fichas técnicas Tecnologías'!$Y$4*Cálculo!$B$130)), MIN(L37,J37+K37/'Fichas técnicas Tecnologías'!$Y$4*Cálculo!$B$130))","v":0},{"$f":"IF('Fichas técnicas Tecnologías'!$Y$3<=$H$2*12,H37,IF(AND('Fichas técnicas Tecnologías'!$Y$3>$H$2*12,'Fichas técnicas Tecnologías'!$Y$3<=$F$2*12),F37,D37))","v":206314606}]
[null,38,"Total Costo de Inversión Inicial",null,{"$f":"+D38/($D$22*Cálculo!$B$130)","v":0},null,null,null,null,null,null,null,null,{"$f":"SUM(N25:N37)","v":6789391381},null,{"$f":"SUM(P25:P37)","v":23942013452}]
[null,39,null,{"$f":"+(D25/(D27+SUM(D29:D37)))","v":0.05},null,{"$f":"+(F25/(F27+SUM(F29:F37)))","v":4.9999999999999996E-2},null,{"$f":"+(H25/(H27+SUM(H29:H37)))","v":3.6293891852410269E-2}]
[null,40,{"$f":"+'Fichas técnicas Tecnologías'!A5","v":"Compostaje cerrado o \"In vessel\""},null,null,null,null,null,null,null,null,null,"Costo según mercado atendido residuos sólidos sin incluir poda, corte de cesped ni plazas de mercado",null,"Costo según mercado atendido de residuos de poda, corte de cesped y plazas de mercado"]
[null,41,"Escala (ton/mes)",38933,null,9125,null,304,null,"Funciones de costos"]
[null,42,"Componentes","Valor (COP)","COP/Ton ","Valor (COP)","COP/Ton ","Valor (COP)","COP/Ton ","a","b","Techo","COP/ton","Valor total","COP/ton","Valor total"]
[{"$f":"$C$40","v":"Compostaje cerrado o \"In vessel\""},43,"Pre-inversión"]
[null,44,"   Estudios, Diseños ",{"$f":"+(D46+SUM(D48:D57))*5%","v":2620483598.75},{"$f":"+D44/($D$41*12)","v":5608.9598343093694},{"$f":"+(F46+SUM(F48:F57))*5%","v":723482998.1500001},{"$f":"+F44/($F$41*12)","v":6607.150668036531},{"$f":"+(H46+SUM(H48:H57))*5%","v":68660586.900000006},{"$f":"+H44/($H$41*12)","v":18821.432812500003},{"$f":"+E44","v":5608.9598343093694},{"$f":"+G44","v":6607.150668036531},{"$f":"+MAX(E44,G44,I44)","v":18821.432812500003},{"$f":"+IF('Fichas técnicas Tecnologías'!$X$3<=$H$2*12,I44,IF(AND('Fichas técnicas Tecnologías'!$X$3>$H$2*12,'Fichas técnicas Tecnologías'!$X$3<=$F$2*12),G44,E44))","v":6607.150668036531},{"$f":"ROUND('Fichas técnicas Tecnologías'!$X$5*M44,-6)","v":304000000}]
[null,45,"   Permisos",386924233,{"$f":"+D45/($D$41*12)","v":828.18395919485613},193740491,{"$f":"+F45/($F$41*12)","v":1769.3195525114156},23607687,{"$f":"+H45/($H$41*12)","v":6471.4054276315792},828.18395919485613,1769.3195525114156,{"$f":"+MAX(E45,G45,I45)","v":6471.4054276315792},{"$f":"+IF('Fichas técnicas Tecnologías'!$X$3<=$H$2*12,I45,IF(AND('Fichas técnicas Tecnologías'!$X$3>$H$2*12,'Fichas técnicas Tecnologías'!$X$3<=$F$2*12),G45,E45))","v":1769.3195525114156},{"$f":"ROUND('Fichas técnicas Tecnologías'!$X$5*M45,-6)","v":81000000}]
[null,46,"Infraestructura",43546869601,{"$f":"+D46/($D$41*12)","v":93208.994942165606},10206297563,{"$f":"+F46/($F$41*12)","v":93208.196922374424},340209919,{"$f":"+H46/($H$41*12)","v":93259.297971491222},{"$f":"+E46","v":93208.994942165606},{"$f":"+G46","v":93208.196922374424},{"$f":"+MAX(E46,G46,I46)","v":93259.297971491222},{"$f":"+IF('Fichas técnicas Tecnologías'!$X$3<=$H$2*12,I46,IF(AND('Fichas técnicas Tecnologías'!$X$3>$H$2*12,'Fichas técnicas Tecnologías'!$X$3<=$F$2*12),G46,E46))","v":93208.196922374424},{"$f":"ROUND('Fichas técnicas Tecnologías'!$X$5*M46,-6)","v":4288000000}]
[null,47,"Maquinaria y Equipos (incluido el costo de instalación)"]
[null,48,"Equipo de compostaje",{"$f":"30*D41*'Datos de entrada'!$B$61","v":4438362000},{"$f":"+D48/($D$41*12)","v":9500},{"$f":"+F41*60*'Datos de entrada'!$B$61","v":2080500000},{"$f":"+F48/($F$41*12)","v":19000},{"$f":"+H41*80*'Datos de entrada'!$B$61","v":92416000},{"$f":"IFERROR(H48/($H$22*12),0)","v":25333.333333333332},{"$f":"+E48","v":9500},{"$f":"+G48","v":19000},{"$f":"+MAX(E48,G48,I48)","v":25333.333333333332},{"$f":"+IF('Fichas técnicas Tecnologías'!$X$3<=$H$2*12,I48,IF(AND('Fichas técnicas Tecnologías'!$X$3>$H$2*12,'Fichas técnicas Tecnologías'!$X$3<=$F$2*12),G48,E48))","v":19000},{"$f":"ROUND('Fichas técnicas Tecnologías'!$X$5*M48,-6)","v":874000000}]
[null,49,"   Trommel",1440055457,3082.3368714629405,360013864,3287.7978447488586,180006932,49344.005482456138,3082.3368714629405,3287.7978447488586,49344.005482456138,{"$f":"+IF('Fichas técnicas Tecnologías'!$X$3<=$H$2*12,I49,IF(AND('Fichas técnicas Tecnologías'!$X$3>$H$2*12,'Fichas técnicas Tecnologías'!$X$3<=$F$2*12),G49,E49))","v":3287.7978447488586},{"$f":"ROUND('Fichas técnicas Tecnologías'!$X$5*M49,-6)","v":151000000}]
[null,50,"   Minicargador",522897985,1119.2261598986292,261448992,2387.6620273972603,261448992,71669.131578947374,null,null,null,{"$f":"+N50/'Fichas técnicas Tecnologías'!$X$5","v":5683.673739130435},{"$f":"IF('Fichas técnicas Tecnologías'!$X$5<=$H$41*12,H50,IF(AND('Fichas técnicas Tecnologías'!$X$5>$H$41*12,'Fichas técnicas Tecnologías'!$X$5<=$F$41*12),F50,D50))","v":261448992}]
[null,51,"   Tractor",522897985,1119.2261598986292,261448992,2387.6620273972603," $ -  ",0,null,null,null,{"$f":"+N51/'Fichas técnicas Tecnologías'!$X$5","v":5683.673739130435},{"$f":"IF('Fichas técnicas Tecnologías'!$X$5<=$H$41*12,H51,IF(AND('Fichas técnicas Tecnologías'!$X$5>$H$41*12,'Fichas técnicas Tecnologías'!$X$5<=$F$41*12),F51,D51))","v":261448992}]
[null,52,"   Retroexcavadora",455788083,975.5821603780854,227894041,2081.2241187214613," $ -  ",0,null,null,null,{"$f":"+N52/'Fichas técnicas Tecnologías'!$X$5","v":4954.2182826086955},{"$f":"IF('Fichas técnicas Tecnologías'!$X$5<=$H$41*12,H52,IF(AND('Fichas técnicas Tecnologías'!$X$5>$H$41*12,'Fichas técnicas Tecnologías'!$X$5<=$F$41*12),F52,D52))","v":227894041}]
[null,53,"   Montacargas",162182263,347.13966515124275,162182263,1481.1165570776257," $ -  ",0,null,null,null,{"$f":"+N53/'Fichas técnicas Tecnologías'!$X$5","v":3525.7013695652172},{"$f":"IF('Fichas técnicas Tecnologías'!$X$5<=$H$41*12,H53,IF(AND('Fichas técnicas Tecnologías'!$X$5>$H$41*12,'Fichas técnicas Tecnologías'!$X$5<=$F$41*12),F53,D53))","v":162182263}]
[null,54,"   Planta electrica",153793525,329.18416467606744,153793525,1404.5070776255707,153793525,42158.312774122809,null,null,null,{"$f":"+N54/'Fichas técnicas Tecnologías'!$X$5","v":3343.3375000000001},{"$f":"IF('Fichas técnicas Tecnologías'!$X$5<=$H$41*12,H54,IF(AND('Fichas técnicas Tecnologías'!$X$5>$H$41*12,'Fichas técnicas Tecnologías'!$X$5<=$F$41*12),F54,D54))","v":153793525}]
[null,55,"   Compresor",37749320,80.799749997859564,37749320,344.7426484018265,37749320,10347.94956140351,null,null,null,{"$f":"+N55/'Fichas técnicas Tecnologías'!$X$5","v":820.63739130434783},{"$f":"IF('Fichas técnicas Tecnologías'!$X$5<=$H$41*12,H55,IF(AND('Fichas técnicas Tecnologías'!$X$5>$H$41*12,'Fichas técnicas Tecnologías'!$X$5<=$F$41*12),F55,D55))","v":37749320}]
[null,56,"   Volqueta",922761150,1975.1049880564046,615174100,5618.0283105022827,307587050,84316.625548245618,null,null,null,{"$f":"+N56/'Fichas técnicas Tecnologías'!$X$5","v":13373.35},{"$f":"IF('Fichas técnicas Tecnologías'!$X$5<=$H$41*12,H56,IF(AND('Fichas técnicas Tecnologías'!$X$5>$H$41*12,'Fichas técnicas Tecnologías'!$X$5<=$F$41*12),F56,D56))","v":615174100}]
[null,57,"   Báscula de pesaje",206314606,441.60182450192212,103157303,942.07582648401831," $ -  ",0,null,null,null,{"$f":"+N57/'Fichas técnicas Tecnologías'!$X$5","v":2242.5500652173914},{"$f":"IF('Fichas técnicas Tecnologías'!$X$5<=$H$41*12,H57,IF(AND('Fichas técnicas Tecnologías'!$X$5>$H$41*12,'Fichas técnicas Tecnologías'!$X$5<=$F$41*12),F57,D57))","v":103157303}]
[null,58,"Total Costo de Inversión Inicial",null,null,null,null,null,null,null,null,null,null,{"$f":"SUM(N44:N57)","v":7520848536}]
[null,59]
[null,60,{"$f":"+'Fichas técnicas Tecnologías'!A6","v":"Tratamiento Mecánico Biológico"},null,null,null,null,null,null,null,null,null,"Costo según mercado atendido residuos sólidos sin incluir poda, corte de cesped ni plazas de mercado",null,"Costo según mercado atendido de residuos de poda, corte de cesped y plazas de mercado"]
[null,61,"Escala (ton/mes)",38933,null,9125,null,304,null,"Funciones de costos"]
[null,62,"Componente","Valor (COP)","COP/Ton ","Valor (COP)","COP/Ton ","Valor (COP)","COP/Ton ","a","b","Techo","COP/ton","Valor total","COP/ton","Valor total"]
[{"$f":"$C$60","v":"Tratamiento Mecánico Biológico"},63,"Pre-inversión"]
[null,64,"   Estudios, Diseños ",{"$f":"+(D66+SUM(D68:D73))*5%","v":771719568.55000007},{"$f":"+D64/(D$61*12)","v":1651.8111639440408},{"$f":"+(F66+SUM(F68:F73))*5%","v":287054974.25},{"$f":"+F64/(F$61*12)","v":2621.5066141552511},{"$f":"+(H66+SUM(H68:H73))*5%","v":12771311.050000001},{"$f":"+H64/(H$61*12)","v":3500.9076343201755},{"$f":"+E64","v":1651.8111639440408},{"$f":"+G64","v":2621.5066141552511},{"$f":"+MAX(E64,G64,I64)","v":3500.9076343201755},{"$f":"+IF('Fichas técnicas Tecnologías'!$X$3<=$H$2*12,I64,IF(AND('Fichas técnicas Tecnologías'!$X$3>$H$2*12,'Fichas técnicas Tecnologías'!$X$3<=$F$2*12),G64,E64))","v":2621.5066141552511},{"$f":"ROUND('Fichas técnicas Tecnologías'!$X$6*M64,-6)","v":121000000}]
[null,65,"   Permisos",386924233,{"$f":"+D65/(D$61*12)","v":828.18395919485613},193740491,1769.3195525114156,23607687,6471.4054276315792,828.18395919485613,1769.3195525114156,{"$f":"+MAX(E65,G65,I65)","v":6471.4054276315792},{"$f":"+IF('Fichas técnicas Tecnologías'!$X$3<=$H$2*12,I65,IF(AND('Fichas técnicas Tecnologías'!$X$3>$H$2*12,'Fichas técnicas Tecnologías'!$X$3<=$F$2*12),G65,E65))","v":1769.3195525114156},{"$f":"ROUND('Fichas técnicas Tecnologías'!$X$6*M65,-6)","v":81000000}]
[null,66,"Infraestructura",8241346817,{"$f":"+D66/(D$61*12)","v":17640.0200708054},1931565660,17639.869041095892,64385522,{"$f":"+H66/(H$61*12)","v":17649.540021929824},{"$f":"+E66","v":17640.0200708054},{"$f":"+G66","v":17639.869041095892},{"$f":"+MAX(E66,G66,I66)","v":17649.540021929824},{"$f":"+IF('Fichas técnicas Tecnologías'!$X$3<=$H$2*12,I66,IF(AND('Fichas técnicas Tecnologías'!$X$3>$H$2*12,'Fichas técnicas Tecnologías'!$X$3<=$F$2*12),G66,E66))","v":17639.869041095892},{"$f":"ROUND('Fichas técnicas Tecnologías'!$X$6*M66,-6)","v":811000000}]
[null,67,"Maquinaria y Equipos (incluido el costo de instalación)"]
[null,68,"   Bandas transportadoras",1098542445,{"$f":"+D68/(D$61*12)","v":2351.3524195412633},659125467,6019.4106575342466,87883396,{"$f":"IFERROR(H68/($H$61*12),0)","v":24090.843201754386},{"$f":"+E68","v":2351.3524195412633},{"$f":"+G68","v":6019.4106575342466},{"$f":"+MAX(E68,G68,I68)","v":24090.843201754386},{"$f":"+IF('Fichas técnicas Tecnologías'!$X$3<=$H$2*12,I68,IF(AND('Fichas técnicas Tecnologías'!$X$3>$H$2*12,'Fichas técnicas Tecnologías'!$X$3<=$F$2*12),G68,E68))","v":6019.4106575342466},{"$f":"ROUND('Fichas técnicas Tecnologías'!$X$6*M68,-6)","v":277000000}]
[null,{"$f":"B68+1","v":69},"   Sistema de tamizaje (piso vivo, tolva viva, bandas y tromel)",878833956,1881.0819356330105,439416978,4012.9404383561646," $ -  ",0,1881.0819356330105,4012.9404383561646,4012.9404383561646,{"$f":"+IF('Fichas técnicas Tecnologías'!$X$3<=$H$2*12,I69,IF(AND('Fichas técnicas Tecnologías'!$X$3>$H$2*12,'Fichas técnicas Tecnologías'!$X$3<=$F$2*12),G69,E69))","v":4012.9404383561646},{"$f":"ROUND('Fichas técnicas Tecnologías'!$X$6*M69,-6)","v":185000000}]
[null,70,"   Imán de remoción de metales",175766791,376.21638669851626,87883396,802.58809132420095," $ -  ",0,null,null,null,{"$f":"+IF('Fichas técnicas Tecnologías'!$X$3<=$H$2*12,I70,IF(AND('Fichas técnicas Tecnologías'!$X$3>$H$2*12,'Fichas técnicas Tecnologías'!$X$3<=$F$2*12),G70,E70))","v":802.58809132420095},{"$f":"IF('Fichas técnicas Tecnologías'!$X$6<=$H$41*12,H70,IF(AND('Fichas técnicas Tecnologías'!$X$6>$H$41*12,'Fichas técnicas Tecnologías'!$X$6<=$F$41*12),F70,D70))","v":87883396}]
[null,71,"   Sistema separación balística ",2197084889,4702.7048369420972,1098542445,10032.351095890412," $ -  ",0,{"$f":"+E71","v":4702.7048369420972},{"$f":"+G71","v":10032.351095890412},10032.351095890412,{"$f":"+IF('Fichas técnicas Tecnologías'!$X$3<=$H$2*12,I71,IF(AND('Fichas técnicas Tecnologías'!$X$3>$H$2*12,'Fichas técnicas Tecnologías'!$X$3<=$F$2*12),G71,E71))","v":10032.351095890412},{"$f":"ROUND('Fichas técnicas Tecnologías'!$X$6*M71,-6)","v":461000000}]
[null,72,"   Rompebolsas",2636501867,5643.2458047586024,1318250933,12038.821305936073," $ -  ",0,5643.2458047586024,12038.821305936073,12038.821305936073,{"$f":"+IF('Fichas técnicas Tecnologías'!$X$3<=$H$2*12,I72,IF(AND('Fichas técnicas Tecnologías'!$X$3>$H$2*12,'Fichas técnicas Tecnologías'!$X$3<=$F$2*12),G72,E72))","v":12038.821305936073},{"$f":"ROUND('Fichas técnicas Tecnologías'!$X$6*M72,-6)","v":554000000}]
[null,73,"   Báscula de pesaje",206314606,441.60182450192212,206314606,1884.1516529680366,103157303,28277.769462719298,441.60182450192212,1884.1516529680366,{"$f":"+MAX(E73,G73,I73)","v":28277.769462719298},{"$f":"+IF('Fichas técnicas Tecnologías'!$X$3<=$H$2*12,I73,IF(AND('Fichas técnicas Tecnologías'!$X$3>$H$2*12,'Fichas técnicas Tecnologías'!$X$3<=$F$2*12),G73,E73))","v":1884.1516529680366},{"$f":"IF('Fichas técnicas Tecnologías'!$X$6<=$H$41*12,H73,IF(AND('Fichas técnicas Tecnologías'!$X$6>$H$41*12,'Fichas técnicas Tecnologías'!$X$6<=$F$41*12),F73,D73))","v":206314606}]
[null,74,"Sistema de compostaje (Compostaje en pilas con aireación forzada)",null,null,null,null,null,null,null,null,null,{"$f":"+SUM(M25:M37)*'Fichas técnicas Tecnologías'!S7","v":88557.782556271588},{"$f":"ROUND('Fichas técnicas Tecnologías'!$X$6*M74,-6)","v":4074000000}]
[null,75,"Total Costo de Inversión Inicial",null,null,null,null,null,null,null,null,null,null,{"$f":"SUM(N64:N74)","v":6858198002}]
[null,76]
[null,77]
[null,78]
[null,79,{"$f":"+'Fichas técnicas Tecnologías'!A9","v":"Digestión Anaerobia"},null,null,null,null,null,null,null,null,null,"Costo según mercado atendido residuos sólidos sin incluir poda, corte de cesped ni plazas de mercado",null,"Costo según mercado atendido de residuos de poda, corte de cesped y plazas de mercado"]
[null,80,"Escala (ton/mes)",38933,null,9125,null,304,null,"Funciones de costos"]
[null,81,"Componente","Valor (COP)","COP/Ton ","Valor (COP)","COP/Ton ","Valor (COP)","COP/Ton ","a","b","Techo","COP/ton","Valor total","COP/ton","Valor total"]
[{"$f":"$C$79","v":"Digestión Anaerobia"},82,"Pre-inversión"]
[null,83,"   Estudios, Diseños ",{"$f":"+(D85+SUM(D87:D88))*5%","v":11208550953},{"$f":"+D83/(D$80*12)","v":23991.110696581305},{"$f":"+(F85+SUM(F87:F88))*5%","v":3187095597.7000003},{"$f":"+F83/(F$80*12)","v":29105.895869406395},{"$f":"+(H85+SUM(H87:H88))*5%","v":837656588.80000007},{"$f":"+H83/(H$80*12)","v":229620.77543859652},{"$f":"+E83","v":23991.110696581305},{"$f":"+G83","v":29105.895869406395},{"$f":"+MAX(E83,G83,I83)","v":229620.77543859652},{"$f":"+IF('Fichas técnicas Tecnologías'!$X$3<=$H$2*12,I83,IF(AND('Fichas técnicas Tecnologías'!$X$3>$H$2*12,'Fichas técnicas Tecnologías'!$X$3<=$F$2*12),G83,E83))","v":29105.895869406395},{"$f":"ROUND('Fichas técnicas Tecnologías'!$X$9*M83,-6)","v":1339000000}]
[null,84,"   Permisos",386924233,{"$f":"+D84/($D$80*12)","v":828.18395919485613},193740491,1769.3195525114156,23607687,6471.4054276315792,828.18395919485613,1769.3195525114156,{"$f":"+MAX(E84,G84,I84)","v":6471.4054276315792},{"$f":"+IF('Fichas técnicas Tecnologías'!$X$3<=$H$2*12,I84,IF(AND('Fichas técnicas Tecnologías'!$X$3>$H$2*12,'Fichas técnicas Tecnologías'!$X$3<=$F$2*12),G84,E84))","v":1769.3195525114156},{"$f":"ROUND('Fichas técnicas Tecnologías'!$X$9*M84,-6)","v":81000000}]
[null,85,"Infraestructura",27471156057,{"$f":"+D85/($D$80*12)","v":58800.066903398147},12877104402,117599.1269589041,3527973809,{"$f":"+H85/(H$80*12)","v":967098.08360745618},{"$f":"+E85","v":58800.066903398147},{"$f":"+G85","v":117599.1269589041},{"$f":"+MAX(E85,G85,I85)","v":967098.08360745618},{"$f":"+IF('Fichas técnicas Tecnologías'!$X$3<=$H$2*12,I85,IF(AND('Fichas técnicas Tecnologías'!$X$3>$H$2*12,'Fichas técnicas Tecnologías'!$X$3<=$F$2*12),G85,E85))","v":117599.1269589041},{"$f":"ROUND('Fichas técnicas Tecnologías'!$X$9*M85,-6)","v":5410000000}]
[null,86,"Maquinaria y Equipos (incluido el costo de instalación)"]
[null,87,"   Digestor y Sistema de manejo de lodos",196493548397,{"$f":"+D87/($D$80*12)","v":420580.54520372604},50658492946,462634.63877625571,13122000664,{"$f":"+H87/(H$80*12)","v":3597039.6557017546},{"$f":"+E87","v":420580.54520372604},{"$f":"+G87","v":462634.63877625571},{"$f":"+MAX(E87,G87,I87)","v":3597039.6557017546},{"$f":"+IF('Fichas técnicas Tecnologías'!$X$3<=$H$2*12,I87,IF(AND('Fichas técnicas Tecnologías'!$X$3>$H$2*12,'Fichas técnicas Tecnologías'!$X$3<=$F$2*12),G87,E87))","v":462634.63877625571},{"$f":"ROUND('Fichas técnicas Tecnologías'!$X$9*M87,-6)","v":21281000000}]
[null,88,"   Báscula de pesaje",206314606,{"$f":"+D88/($D$80*12)","v":441.60182450192212},206314606,1884.1516529680366,103157303,{"$f":"+H88/(H$80*12)","v":28277.769462719298},null,null,null,{"$f":"+IF('Fichas técnicas Tecnologías'!$X$3<=$H$2*12,I88,IF(AND('Fichas técnicas Tecnologías'!$X$3>$H$2*12,'Fichas técnicas Tecnologías'!$X$3<=$F$2*12),G88,E88))","v":1884.1516529680366},{"$f":"IF('Fichas técnicas Tecnologías'!$X$9<=$H$41*12,H88,IF(AND('Fichas técnicas Tecnologías'!$X$9>$H$41*12,'Fichas técnicas Tecnologías'!$X$9<=$F$41*12),F88,D88))","v":206314606}]
[null,89,"Total Costo de Inversión Inicial",null,null,null,null,null,null,null,null,null,null,{"$f":"SUM(N83:N88)","v":28317314606}]
[null,90]
[null,91]
[null,92]
[null,93]
[null,94]
[null,95]
[null,96]
[null,97]
[null,98]
[null,99]
[null,100]
[null,101]
[null,102]
[null,103]
[null,104]
[null,105]
[null,106]
[null,107]
[null,108]
[null,109]
[null,110]
[null,111]
[null,112]
[null,113]
[null,114]
[null,115]
[null,116]
[null,117]
[null,118]
[null,119]
[null,120]
[null,121]
[null,122]
[null,123]
[null,124]
[null,125]
[null,126]
[null,127]
[null,128]
[null,129]
[null,130]
[null,131]
[null,132]
[null,{"$f":"B132+1","v":133}]
[null,134]
[null,135]
[null,136]
[null,137]
[null,138]
[null,139]
[null,140]
[null,141]
[null,142]
[null,143]
[null,144]
[null,145]
[null,146]
[null,147]
[null,148]
[null,149]
[null,150]
[null,151]
[null,152]
[null,153]
[null,154]
[null,155]
[null,156]
[null,157]
[null,158]
[null,159]
[null,160]
[null,161]
[null,162]
[null,163]
[null,164]
[null,165]
[null,166]
[null,167]
[null,168]
[null,169]
[null,170]
[null,171]
[null,172]
[null,173]
[null,174]
[null,175]
[null,176]
[null,177]
[null,178]
[null,179]
[null,180]
[null,181]
[null,182]
[null,183]
[null,184]
[null,185]
[null,186]
[null,187]
[null,188]
[null,189]
[null,190]
[null,191]
[null,192]
[null,193]
[null,194]
[null,195]
[null,196]
[null,{"$f":"B196+1","v":197}]
[null,198]
[null,199]
[null,200]
[null,201]
[null,202]
[null,203]
[null,204]
[null,205]
[null,206]
[null,207]
[null,208]
[null,209]
[null,210]
[null,211]
[null,212]
[null,213]
[null,214]
[null,215]
[null,216]
[null,217]
[null,218]
[null,219]
[null,220]
[null,221]
[null,222]
[null,223]
[null,224]
[null,225]
[null,226]
[null,227]
[null,228]
[null,229]
[null,230]
[null,231]
[null,232]
[null,233]
[null,234]
[null,235]
[null,236]
[null,237]
[null,238]
[null,239]
[null,240]
[null,241]
[null,242]
[null,243]
[null,244]
[null,245]
[null,246]
[null,247]
[null,248]
[null,249]
[null,250]
[null,251]
[null,252]
[null,253]
[null,254]
[null,255]
[null,256]
[null,257]
[null,258]
[null,259]
[null,260]
[null,{"$f":"B260+1","v":261}]
[null,262]
[null,263]
[null,264]
[null,265]
[null,266]
[null,267]
[null,268]
[null,269]
[null,270]
[null,271]
[null,272]
[null,273]
[null,274]
[null,275]
[null,276]
[null,277]
[null,278]
[null,279]
[null,280]
[null,281]
[null,282]
[null,283]
[null,284]
[null,285]
[null,286]
[null,287]
[null,288]
[null,289]
[null,290]
[null,291]
[null,292]
[null,293]
[null,294]
[null,295]
[null,296]
[null,297]
[null,298]
[null,299]
[null,300]
[null,301]
[null,302]
[null,303]
[null,304]
[null,305]
[null,306]
[null,307]
[null,308]
[null,309]
[null,310]
[null,311]
[null,312]
[null,313]
[null,314]
[null,315]
[null,316]
[null,317]
[null,318]
[null,319]
[null,320]
[null,321]
[null,322]
[null,323]
[null,324]
[null,{"$f":"B324+1","v":325}]
[null,326]
[null,327]
[null,328]
[null,329]
[null,330]
[null,331]
[null,332]
[null,333]
[null,334]
[null,335]
[null,336]
[null,337]
[null,338]
[null,339]
[null,340]
[null,341]
[null,342]
[null,343]
[null,344]
[null,345]
[null,346]
[null,347]
[null,348]
[null,349]
[null,350]
[null,351]
[null,352]
[null,353]
[null,354]
[null,355]
[null,356]
[null,357]
[null,358]
[null,359]
[null,360]
[null,361]
[null,362]
[null,363]
[null,364]
[null,365]
[null,366]
[null,367]
[null,368]
[null,369]
[null,370]
[null,371]
[null,372]
[null,373]
[null,374]
[null,375]
[null,376]
[null,377]
[null,378]
[null,379]
[null,380]
[null,381]
[null,382]
[null,383]
[null,384]
[null,385]
[null,386]
[null,387]
[null,388]
[null,{"$f":"B388+1","v":389}]
[null,390]
[null,391]
[null,392]
[null,393]
[null,394]
[null,395]
[null,396]
[null,397]
[null,398]
[null,399]
[null,400]
[null,401]
[null,402]
[null,403]
[null,404]
[null,405]
[null,406]
[null,407]
[null,408]
[null,409]
[null,410]
[null,411]
[null,412]
[null,413]

{"sheet":"Información municipios","index":14,"n_rows":1124,"n_cols":19,"rows_kept":1124,"cut":false,"hidden":true,"merged":[[1,17,1,18]]}
[]
[null,"Código DANE Atendido","Departamento Atendido","Municipio Atendido","Departamento - Municipio","POBLACIÓN 2019*","Prom DF Ton/Día 2019 AJUSTADO","Prom Ton/día RSO ESTIMADO","Segmento",null,null,null,null,null,"Segmento de mercado ","Ton RSO/día","Ton RSO/mes","Tecnología más apropiada"]
[null,91001,"AMAZONAS","LETICIA",{"$f":"C3&\" - \"&D3","v":"AMAZONAS - LETICIA"},42610,6.37,3.9175499999999999,{"$f":"IF(H3<$P$3,$O$3,IF(H3<$P$4,$O$4,IF(H3<$P$5,$O$5,$O$6)))","v":1},null,null,null,null,null,1,10,{"$f":"+P3*30","v":300},{"$f":"Cálculo!C156","v":"Compostaje en pilas con volteo manual"},{"$f":"Cálculo!C157","v":"Compostaje en pilas con aireación forzada"}]
[null,91540,"AMAZONAS","PUERTO NARIÑO",{"$f":"C4&\" - \"&D4","v":"AMAZONAS - PUERTO NARIÑO"},8643,0.97,0.59655000000000002,{"$f":"IF(H4<$P$3,$O$3,IF(H4<$P$4,$O$4,IF(H4<$P$5,$O$5,$O$6)))","v":1},null,null,null,null,null,2,50,{"$f":"+P4*30","v":1500},{"$f":"Cálculo!C157","v":"Compostaje en pilas con aireación forzada"},{"$f":"Cálculo!C156","v":"Compostaje en pilas con volteo manual"}]
[null,91263,"AMAZONAS","EL ENCANTO  ","AMAZONAS - EL ENCANTO  ",5018,2.2882079999999996,1.4072479199999997,1,null,null,null,null,null,3,500,{"$f":"+P5*30","v":15000},{"$f":"Cálculo!C159","v":"Tratamiento Mecánico Biológico"},{"$f":"Cálculo!C158","v":"Compostaje cerrado o \"In vessel\""}]
[null,91405,"AMAZONAS","LA CHORRERA  ","AMAZONAS - LA CHORRERA  ",4102,1.8705119999999997,1.1503648799999999,1,null,null,null,null,null,4,null,null,{"$f":"Cálculo!C159","v":"Tratamiento Mecánico Biológico"},{"$f":"Cálculo!C160","v":"Digestión Anaerobia"}]
[null,91407,"AMAZONAS","LA PEDRERA  ","AMAZONAS - LA PEDRERA  ",5569,2.5394639999999997,1.5617703599999999,1,null,null,null,null,null,5]
[null,91430,"AMAZONAS","LA VICTORIA  ","AMAZONAS - LA VICTORIA  ",1153,0.5257679999999999,0.32334731999999994,1]
[null,91460,"AMAZONAS","MIRITI - PARANÁ  ","AMAZONAS - MIRITI - PARANÁ  ",1512,0.68947200000000008,0.42402528000000006,1]
[null,91530,"AMAZONAS","PUERTO ALEGRÍA  ","AMAZONAS - PUERTO ALEGRÍA  ",2289,1.043784,0.64192716000000005,1]
[null,91536,"AMAZONAS","PUERTO ARICA  ","AMAZONAS - PUERTO ARICA  ",1310,0.59736,0.36737639999999999,1]
[null,91669,"AMAZONAS","PUERTO SANTANDER  ","AMAZONAS - PUERTO SANTANDER  ",3177,1.448712,0.89095787999999998,1]
[null,91798,"AMAZONAS","TARAPACÁ  ","AMAZONAS - TARAPACÁ  ",4356,1.9863359999999997,1.2215966399999998,1]
[null,5001,"ANTIOQUIA","MEDELLÍN","ANTIOQUIA - MEDELLÍN",2549537,1837.97,1130.3515500000001,4]
[null,5002,"ANTIOQUIA","ABEJORRAL","ANTIOQUIA - ABEJORRAL",18882,6,3.69,1]
[null,5004,"ANTIOQUIA","ABRIAQUÍ","ANTIOQUIA - ABRIAQUÍ",1918,0.19,0.11685,1]
[null,5021,"ANTIOQUIA","ALEJANDRÍA","ANTIOQUIA - ALEJANDRÍA",3307,1.05,0.64575000000000005,1]
[null,5030,"ANTIOQUIA","AMAGÁ","ANTIOQUIA - AMAGÁ",30376,11.35,6.9802499999999998,1]
[null,5031,"ANTIOQUIA","AMALFI","ANTIOQUIA - AMALFI",22714,9.24,5.6825999999999999,1]
[null,5034,"ANTIOQUIA","ANDES","ANTIOQUIA - ANDES",47384,20.46,12.5829,2]
[null,5036,"ANTIOQUIA","ANGELÓPOLIS","ANTIOQUIA - ANGELÓPOLIS",9492,1.56,0.95940000000000003,1]
[null,5038,"ANTIOQUIA","ANGOSTURA","ANTIOQUIA - ANGOSTURA",10932,0.27,0.16605,1]
[null,5040,"ANTIOQUIA","ANORÍ","ANTIOQUIA - ANORÍ",17962,4.5199999999999996,2.7797999999999998,1]
[null,5042,"ANTIOQUIA","SANTA FÉ DE ANTIOQUIA","ANTIOQUIA - SANTA FÉ DE ANTIOQUIA",25239,16.04,9.8645999999999994,1]
[null,5044,"ANTIOQUIA","ANZÁ","ANTIOQUIA - ANZÁ",7610,0.68,0.41820000000000002,1]
[null,5045,"ANTIOQUIA","APARTADÓ","ANTIOQUIA - APARTADÓ",200931,97.57,60.005549999999992,3]
[null,5051,"ANTIOQUIA","ARBOLETES","ANTIOQUIA - ARBOLETES",44560,11.25,6.9187500000000002,1]
[null,5055,"ANTIOQUIA","ARGELIA","ANTIOQUIA - ARGELIA",8165,1.6,0.98399999999999999,1]
[null,5059,"ANTIOQUIA","ARMENIA","ANTIOQUIA - ARMENIA",3854,0.88,0.54120000000000001,1]
[null,5079,"ANTIOQUIA","BARBOSA","ANTIOQUIA - BARBOSA",53167,43.42,26.703300000000002,2]
[null,5086,"ANTIOQUIA","BELMIRA","ANTIOQUIA - BELMIRA",6991,1.42,0.87329999999999997,1]
[null,5088,"ANTIOQUIA","BELLO","ANTIOQUIA - BELLO",491182,299.81,184.38315,3]
[null,5091,"ANTIOQUIA","BETANIA","ANTIOQUIA - BETANIA",8864,2.4700000000000002,1.51905,1]
[null,5093,"ANTIOQUIA","BETULIA","ANTIOQUIA - BETULIA",17773,2.46,1.5128999999999999,1]
[null,5101,"ANTIOQUIA","CIUDAD BOLÍVAR","ANTIOQUIA - CIUDAD BOLÍVAR",26567,8.41,5.1721500000000002,1]
[null,5107,"ANTIOQUIA","BRICEÑO","ANTIOQUIA - BRICEÑO",8662,2.67,1.64205,1]
[null,5113,"ANTIOQUIA","BURITICÁ","ANTIOQUIA - BURITICÁ",6446,2.38,1.4637,1]
[null,5120,"ANTIOQUIA","CÁCERES","ANTIOQUIA - CÁCERES",42112,7.65,4.7047499999999998,1]
[null,5125,"ANTIOQUIA","CAICEDO","ANTIOQUIA - CAICEDO",8457,0.98,0.60270000000000001,1]
[null,5129,"ANTIOQUIA","CALDAS","ANTIOQUIA - CALDAS",81381,0.38,0.23369999999999999,1]
[null,5134,"ANTIOQUIA","CAMPAMENTO","ANTIOQUIA - CAMPAMENTO",8839,0.66,0.40590000000000004,1]
[null,5138,"ANTIOQUIA","CAÑASGORDAS","ANTIOQUIA - CAÑASGORDAS",16725,2.0699999999999998,1.2730499999999998,1]
[null,5142,"ANTIOQUIA","CARACOLÍ","ANTIOQUIA - CARACOLÍ",4491,0.55000000000000004,0.33825,1]
[null,5145,"ANTIOQUIA","CARAMANTA","ANTIOQUIA - CARAMANTA",5276,0.8,0.49199999999999999,1]
[null,5147,"ANTIOQUIA","CAREPA","ANTIOQUIA - CAREPA",61641,37.01,22.761149999999997,2]
[null,5148,"ANTIOQUIA","EL CARMEN DE VIBORAL","ANTIOQUIA - EL CARMEN DE VIBORAL",49076,24.33,14.962949999999999,2]
[null,5150,"ANTIOQUIA","CAROLINA","ANTIOQUIA - CAROLINA",3474,1.1100000000000001,0.68265000000000009,1]
[null,5154,"ANTIOQUIA","CAUCASIA","ANTIOQUIA - CAUCASIA",123304,53.22,32.7303,2]
[null,5172,"ANTIOQUIA","CHIGORODÓ","ANTIOQUIA - CHIGORODÓ",84183,19.78,12.1647,2]
[null,5190,"ANTIOQUIA","CISNEROS","ANTIOQUIA - CISNEROS",8798,4.97,3.0565499999999997,1]
[null,5197,"ANTIOQUIA","COCORNÁ","ANTIOQUIA - COCORNÁ",14909,1.71,1.05165,1]
[null,5206,"ANTIOQUIA","CONCEPCIÓN","ANTIOQUIA - CONCEPCIÓN",3114,0.72,0.44279999999999997,1]
[null,5209,"ANTIOQUIA","CONCORDIA","ANTIOQUIA - CONCORDIA",20271,3.06,1.8818999999999999,1]
[null,5212,"ANTIOQUIA","COPACABANA","ANTIOQUIA - COPACABANA",73574,41.23,25.356449999999999,2]
[null,5234,"ANTIOQUIA","DABEIBA","ANTIOQUIA - DABEIBA",22954,6.84,4.2065999999999999,1]
[null,5237,"ANTIOQUIA","DONMATÍAS","ANTIOQUIA - DONMATÍAS",24201,11.44,7.0355999999999996,1]
[null,5240,"ANTIOQUIA","EBÉJICO","ANTIOQUIA - EBÉJICO",12478,1.91,1.17465,1]
[null,5250,"ANTIOQUIA","EL BAGRE","ANTIOQUIA - EL BAGRE",50863,14.27,8.7760499999999997,1]
[null,5264,"ANTIOQUIA","ENTRERRÍOS","ANTIOQUIA - ENTRERRÍOS",10547,4.3099999999999996,2.6506499999999997,1]
[null,5266,"ANTIOQUIA","ENVIGADO","ANTIOQUIA - ENVIGADO",243609,170.11,104.61765000000001,3]
[null,5282,"ANTIOQUIA","FREDONIA","ANTIOQUIA - FREDONIA",20997,5.36,3.2964000000000002,1]
[null,5284,"ANTIOQUIA","FRONTINO","ANTIOQUIA - FRONTINO",15401,2.69,1.65435,1]
[null,5306,"ANTIOQUIA","GIRALDO","ANTIOQUIA - GIRALDO",3953,0.11,6.7650000000000002E-2,1]
[null,5308,"ANTIOQUIA","GIRARDOTA","ANTIOQUIA - GIRARDOTA",59319,30.39,18.68985,2]
[null,5310,"ANTIOQUIA","GÓMEZ PLATA","ANTIOQUIA - GÓMEZ PLATA",13417,2.61,1.6051499999999999,1]
[null,5313,"ANTIOQUIA","GRANADA","ANTIOQUIA - GRANADA",9885,2,1.23,1]
[null,5315,"ANTIOQUIA","GUADALUPE","ANTIOQUIA - GUADALUPE",6324,1.32,0.81180000000000008,1]
[null,5318,"ANTIOQUIA","GUARNE",{"$f":"C68&\" - \"&D68","v":"ANTIOQUIA - GUARNE"},51265,20.6,12.669,{"$f":"IF(H68<$P$3,$O$3,IF(H68<$P$4,$O$4,IF(H68<$P$5,$O$5,$O$6)))","v":2}]
[null,5321,"ANTIOQUIA","GUATAPÉ","ANTIOQUIA - GUATAPÉ",5046,3.5,2.1524999999999999,1]
[null,5347,"ANTIOQUIA","HELICONIA","ANTIOQUIA - HELICONIA",5616,1.7,1.0454999999999999,1]
[null,5353,"ANTIOQUIA","HISPANIA","ANTIOQUIA - HISPANIA",4890,0.43,0.26445000000000002,1]
[null,5360,"ANTIOQUIA","ITAGÜÍ","ANTIOQUIA - ITAGÜÍ",279871,240.73,148.04894999999999,3]
[null,5361,"ANTIOQUIA","ITUANGO","ANTIOQUIA - ITUANGO",19578,5.4,3.3210000000000002,1]
[null,5364,"ANTIOQUIA","JARDÍN","ANTIOQUIA - JARDÍN",13426,3.15,1.9372499999999999,1]
[null,5368,"ANTIOQUIA","JERICÓ","ANTIOQUIA - JERICÓ",11765,4.21,2.5891500000000001,1]
[null,5376,"ANTIOQUIA","LA CEJA","ANTIOQUIA - LA CEJA",55246,34.450000000000003,21.18675,2]
[null,5380,"ANTIOQUIA","LA ESTRELLA","ANTIOQUIA - LA ESTRELLA",66281,1.45,0.89174999999999993,1]
[null,5390,"ANTIOQUIA","LA PINTADA","ANTIOQUIA - LA PINTADA",6343,4.74,2.9151000000000002,1]
[null,5400,"ANTIOQUIA","LA UNIÓN","ANTIOQUIA - LA UNIÓN",19502,11.06,6.8018999999999998,1]
[null,5411,"ANTIOQUIA","LIBORINA","ANTIOQUIA - LIBORINA",9586,1.87,1.15005,1]
[null,5425,"ANTIOQUIA","MACEO","ANTIOQUIA - MACEO",6537,2.8,1.722,1]
[null,5440,"ANTIOQUIA","MARINILLA","ANTIOQUIA - MARINILLA",56608,34.28,21.0822,2]
[null,5467,"ANTIOQUIA","MONTEBELLO","ANTIOQUIA - MONTEBELLO",5707,1.31,0.80564999999999998,1]
[null,5475,"ANTIOQUIA","MURINDÓ","ANTIOQUIA - MURINDÓ",4992,0.42,0.25829999999999997,1]
[null,5480,"ANTIOQUIA","MUTATÁ","ANTIOQUIA - MUTATÁ",22505,12.12,7.4537999999999993,1]
[null,5483,"ANTIOQUIA","NARIÑO","ANTIOQUIA - NARIÑO",18100,1.5,0.92249999999999999,1]
[null,5490,"ANTIOQUIA","NECOCLÍ","ANTIOQUIA - NECOCLÍ",69090,21.35,13.13025,2]
[null,5495,"ANTIOQUIA","NECHÍ","ANTIOQUIA - NECHÍ",29270,5.65,3.4747500000000002,1]
[null,5501,"ANTIOQUIA","OLAYA","ANTIOQUIA - OLAYA",3377,0.73,0.44894999999999996,1]
[null,5541,"ANTIOQUIA","PEÑOL","ANTIOQUIA - PEÑOL",15690,10.43,6.4144499999999995,1]
[null,5543,"ANTIOQUIA","PEQUE","ANTIOQUIA - PEQUE",11462,1.1299999999999999,0.69494999999999996,1]
[null,5576,"ANTIOQUIA","PUEBLORRICO","ANTIOQUIA - PUEBLORRICO",6558,2.3199999999999998,1.4267999999999998,1]
[null,5579,"ANTIOQUIA","PUERTO BERRÍO","ANTIOQUIA - PUERTO BERRÍO",50232,17.440000000000001,10.7256,2]
[null,5585,"ANTIOQUIA","PUERTO NARE","ANTIOQUIA - PUERTO NARE",19382,6.31,3.8806499999999997,1]
[null,5591,"ANTIOQUIA","PUERTO TRIUNFO","ANTIOQUIA - PUERTO TRIUNFO",21745,10.3,6.3345000000000002,1]
[null,5604,"ANTIOQUIA","REMEDIOS","ANTIOQUIA - REMEDIOS",32057,12.86,7.9088999999999992,1]
[null,5607,"ANTIOQUIA","RETIRO","ANTIOQUIA - RETIRO",19898,15.11,9.2926500000000001,1]
[null,5615,"ANTIOQUIA","RIONEGRO","ANTIOQUIA - RIONEGRO",128153,120.37,74.027550000000005,3]
[null,5628,"ANTIOQUIA","SABANALARGA","ANTIOQUIA - SABANALARGA",8191,1.1000000000000001,0.67649999999999999,1]
[null,5631,"ANTIOQUIA","SABANETA","ANTIOQUIA - SABANETA",54573,76.89,47.287349999999996,2]
[null,5642,"ANTIOQUIA","SALGAR","ANTIOQUIA - SALGAR",17324,4.55,2.7982499999999999,1]
[null,5647,"ANTIOQUIA","SAN ANDRÉS DE CUERQUÍA","ANTIOQUIA - SAN ANDRÉS DE CUERQUÍA",5810,1.86,1.1439000000000001,1]
[null,5649,"ANTIOQUIA","SAN CARLOS","ANTIOQUIA - SAN CARLOS",16152,3.54,2.1770999999999998,1]
[null,5652,"ANTIOQUIA","SAN FRANCISCO","ANTIOQUIA - SAN FRANCISCO",4918,0.69,0.42434999999999995,1]
[null,5656,"ANTIOQUIA","SAN JERÓNIMO","ANTIOQUIA - SAN JERÓNIMO",12972,9.6,5.9039999999999999,1]
[null,5658,"ANTIOQUIA","SAN JOSÉ DE LA MONTAÑA","ANTIOQUIA - SAN JOSÉ DE LA MONTAÑA",3473,2.74,1.6851,1]
[null,5659,"ANTIOQUIA","SAN JUAN DE URABÁ","ANTIOQUIA - SAN JUAN DE URABÁ",27149,10.68,6.5682,1]
[null,5660,"ANTIOQUIA","SAN LUIS","ANTIOQUIA - SAN LUIS",10923,3.25,1.99875,1]
[null,5664,"ANTIOQUIA","SAN PEDRO DE LOS MILAGROS","ANTIOQUIA - SAN PEDRO DE LOS MILAGROS",28438,0.22,0.1353,1]
[null,5665,"ANTIOQUIA","SAN PEDRO DE URABÁ","ANTIOQUIA - SAN PEDRO DE URABÁ",32328,11.81,7.2631500000000004,1]
[null,5667,"ANTIOQUIA","SAN RAFAEL","ANTIOQUIA - SAN RAFAEL",12769,3.67,2.25705,1]
[null,5670,"ANTIOQUIA","SAN ROQUE","ANTIOQUIA - SAN ROQUE",16232,4.63,2.8474499999999998,1]
[null,5674,"ANTIOQUIA","SAN VICENTE FERRER","ANTIOQUIA - SAN VICENTE FERRER",16274,3.42,2.1032999999999999,1]
[null,5679,"ANTIOQUIA","SANTA BÁRBARA","ANTIOQUIA - SANTA BÁRBARA",21413,7.53,4.6309500000000003,1]
[null,5686,"ANTIOQUIA","SANTA ROSA DE OSOS","ANTIOQUIA - SANTA ROSA DE OSOS",37435,16.73,10.28895,2]
[null,5690,"ANTIOQUIA","SANTO DOMINGO","ANTIOQUIA - SANTO DOMINGO",9927,3.49,2.14635,1]
[null,5697,"ANTIOQUIA","EL SANTUARIO","ANTIOQUIA - EL SANTUARIO",27316,14.08,8.6592000000000002,1]
[null,5736,"ANTIOQUIA","SEGOVIA","ANTIOQUIA - SEGOVIA",42222,41.26,25.374899999999997,2]
[null,5756,"ANTIOQUIA","SONSÓN","ANTIOQUIA - SONSÓN",33981,7.71,4.7416499999999999,1]
[null,5761,"ANTIOQUIA","SOPETRÁN","ANTIOQUIA - SOPETRÁN",15172,6.11,3.7576499999999999,1]
[null,5789,"ANTIOQUIA","TÁMESIS","ANTIOQUIA - TÁMESIS",14059,3.75,2.3062499999999999,1]
[null,5790,"ANTIOQUIA","TARAZÁ","ANTIOQUIA - TARAZÁ",47625,10.17,6.2545500000000001,1]
[null,5792,"ANTIOQUIA","TARSO","ANTIOQUIA - TARSO",8152,1.68,1.0331999999999999,1]
[null,5809,"ANTIOQUIA","TITIRIBÍ","ANTIOQUIA - TITIRIBÍ",14791,1.76,1.0824,1]
[null,5819,"ANTIOQUIA","TOLEDO","ANTIOQUIA - TOLEDO",6744,1.7,1.0454999999999999,1]
[null,5837,"ANTIOQUIA","TURBO","ANTIOQUIA - TURBO",176813,70.09,43.105350000000001,2]
[null,5842,"ANTIOQUIA","URAMITA","ANTIOQUIA - URAMITA",8203,0.88,0.54120000000000001,1]
[null,5847,"ANTIOQUIA","URRAO","ANTIOQUIA - URRAO",47128,4.88,3.0011999999999999,1]
[null,5854,"ANTIOQUIA","VALDIVIA","ANTIOQUIA - VALDIVIA",24538,5.91,3.6346500000000002,1]
[null,5856,"ANTIOQUIA","VALPARAÍSO","ANTIOQUIA - VALPARAÍSO",6084,0.57999999999999996,0.35669999999999996,1]
[null,5858,"ANTIOQUIA","VEGACHÍ","ANTIOQUIA - VEGACHÍ",8783,4.6900000000000004,2.8843500000000004,1]
[null,5861,"ANTIOQUIA","VENECIA",{"$f":"C132&\" - \"&D132","v":"ANTIOQUIA - VENECIA"},13158,6.11,3.7576499999999999,{"$f":"IF(H132<$P$3,$O$3,IF(H132<$P$4,$O$4,IF(H132<$P$5,$O$5,$O$6)))","v":1}]
[null,5873,"ANTIOQUIA","VIGÍA DEL FUERTE","ANTIOQUIA - VIGÍA DEL FUERTE",5623,1.43,0.87944999999999995,1]
[null,5885,"ANTIOQUIA","YALÍ","ANTIOQUIA - YALÍ",8672,3.05,1.8757499999999998,1]
[null,5887,"ANTIOQUIA","YARUMAL","ANTIOQUIA - YARUMAL",49109,10.82,6.6543000000000001,1]
[null,5890,"ANTIOQUIA","YOLOMBÓ","ANTIOQUIA - YOLOMBÓ",25647,3.86,2.3738999999999999,1]
[null,5893,"ANTIOQUIA","YONDÓ","ANTIOQUIA - YONDÓ",20136,5.72,3.5177999999999998,1]
[null,5895,"ANTIOQUIA","ZARAGOZA","ANTIOQUIA - ZARAGOZA",32265,7.37,4.5325499999999996,1]
[null,81001,"ARAUCA","ARAUCA","ARAUCA - ARAUCA",93261,71.75,44.126249999999999,2]
[null,81065,"ARAUCA","ARAUQUITA","ARAUCA - ARAUQUITA",42977,7.38,4.5386999999999995,1]
[null,81220,"ARAUCA","CRAVO NORTE","ARAUCA - CRAVO NORTE",3190,1.37,0.84255000000000002,1]
[null,81300,"ARAUCA","FORTUL","ARAUCA - FORTUL",26798,5.83,3.5854499999999998,1]
[null,81591,"ARAUCA","PUERTO RONDÓN","ARAUCA - PUERTO RONDÓN",3820,0.78,0.47970000000000002,1]
[null,81736,"ARAUCA","SARAVENA","ARAUCA - SARAVENA",48647,27.55,16.943249999999999,2]
[null,81794,"ARAUCA","TAME","ARAUCA - TAME",54628,18.21,11.199149999999999,2]
[null,88001,"ARCHIPIÉLAGO DE SAN ANDRÉS, PROVIDENCIA Y\nSANTA CATALINA","SAN ANDRÉS","ARCHIPIÉLAGO DE SAN ANDRÉS, PROVIDENCIA Y\nSANTA CATALINA - SAN ANDRÉS",73850,71.98,44.267700000000005,2]
[null,88564,"ARCHIPIÉLAGO DE SAN ANDRÉS, PROVIDENCIA Y\nSANTA CATALINA","PROVIDENCIA","ARCHIPIÉLAGO DE SAN ANDRÉS, PROVIDENCIA Y\nSANTA CATALINA - PROVIDENCIA",5210,2.66,1.6359000000000001,1]
[null,8001,"ATLÁNTICO","BARRANQUILLA","ATLÁNTICO - BARRANQUILLA",1236202,1516.9,932.89350000000002,4]
[null,8078,"ATLÁNTICO","BARANOA","ATLÁNTICO - BARANOA",60092,49.73,30.583949999999998,2]
[null,8137,"ATLÁNTICO","CAMPO DE LA CRUZ","ATLÁNTICO - CAMPO DE LA CRUZ",14933,7.97,4.9015499999999994,1]
[null,8141,"ATLÁNTICO","CANDELARIA","ATLÁNTICO - CANDELARIA",12576,5.87,3.6100500000000002,1]
[null,8296,"ATLÁNTICO","GALAPA","ATLÁNTICO - GALAPA",47556,42.09,25.885350000000003,2]
[null,8372,"ATLÁNTICO","JUAN DE ACOSTA","ATLÁNTICO - JUAN DE ACOSTA",17704,12.89,7.9273500000000006,1]
[null,8421,"ATLÁNTICO","LURUACO","ATLÁNTICO - LURUACO",28246,7.1,4.3664999999999994,1]
[null,8433,"ATLÁNTICO","MALAMBO","ATLÁNTICO - MALAMBO",129148,99.03,60.903449999999999,3]
[null,8436,"ATLÁNTICO","MANATÍ","ATLÁNTICO - MANATÍ",16473,6.25,3.84375,1]
[null,8520,"ATLÁNTICO","PALMAR DE VARELA","ATLÁNTICO - PALMAR DE VARELA",25886,20.47,12.589049999999999,2]
[null,8549,"ATLÁNTICO","PIOJÓ","ATLÁNTICO - PIOJÓ",5177,3.06,1.8818999999999999,1]
[null,8558,"ATLÁNTICO","POLONUEVO","ATLÁNTICO - POLONUEVO",15765,14.82,9.1143000000000001,1]
[null,8560,"ATLÁNTICO","PONEDERA","ATLÁNTICO - PONEDERA",23578,12.56,7.7244000000000002,1]
[null,8573,"ATLÁNTICO","PUERTO COLOMBIA","ATLÁNTICO - PUERTO COLOMBIA",26595,69.72,42.877800000000001,2]
[null,8606,"ATLÁNTICO","REPELÓN","ATLÁNTICO - REPELÓN",27445,11.14,6.8511000000000006,1]
[null,8634,"ATLÁNTICO","SABANAGRANDE","ATLÁNTICO - SABANAGRANDE",34369,24.49,15.061349999999999,2]
[null,8638,"ATLÁNTICO","SABANALARGA","ATLÁNTICO - SABANALARGA",102334,62.04,38.154600000000002,2]
[null,8675,"ATLÁNTICO","SANTA LUCÍA","ATLÁNTICO - SANTA LUCÍA",11209,4.9800000000000004,3.0627000000000004,1]
[null,8685,"ATLÁNTICO","SANTO TOMÁS","ATLÁNTICO - SANTO TOMÁS",25775,26,15.99,2]
[null,8758,"ATLÁNTICO","SOLEDAD","ATLÁNTICO - SOLEDAD",683580,452.76,278.44740000000002,3]
[null,8770,"ATLÁNTICO","SUAN","ATLÁNTICO - SUAN",8369,7.77,4.7785500000000001,1]
[null,8832,"ATLÁNTICO","TUBARÁ","ATLÁNTICO - TUBARÁ",11013,6.24,3.8376000000000001,1]
[null,8849,"ATLÁNTICO","USIACURÍ","ATLÁNTICO - USIACURÍ",9566,6.29,3.86835,1]
[null,11001,"BOGOTÁ, D.C.","BOGOTÁ, D.C.","BOGOTÁ, D.C. - BOGOTÁ, D.C.",8281030,6952.49,4275.7813500000002,4]
[null,13001,"BOLÍVAR","CARTAGENA DE INDIAS","BOLÍVAR - CARTAGENA DE INDIAS",1047005,1264.1300000000001,777.43995000000007,4]
[null,13006,"BOLÍVAR","ACHÍ","BOLÍVAR - ACHÍ",24673,1.54,0.94710000000000005,1]
[null,13030,"BOLÍVAR","ALTOS DEL ROSARIO","BOLÍVAR - ALTOS DEL ROSARIO",14763,2.12,1.3038000000000001,1]
[null,13042,"BOLÍVAR","ARENAL","BOLÍVAR - ARENAL",20625,5.2,3.198,1]
[null,13052,"BOLÍVAR","ARJONA","BOLÍVAR - ARJONA",78070,25.95,15.959249999999999,2]
[null,13062,"BOLÍVAR","ARROYOHONDO","BOLÍVAR - ARROYOHONDO",10445,2.19,1.3468499999999999,1]
[null,13074,"BOLÍVAR","BARRANCO DE LOBA","BOLÍVAR - BARRANCO DE LOBA",19100,2.39,1.4698500000000001,1]
[null,13140,"BOLÍVAR","CALAMAR","BOLÍVAR - CALAMAR",24573,9.85,6.0577499999999995,1]
[null,13160,"BOLÍVAR","CANTAGALLO","BOLÍVAR - CANTAGALLO",9888,1.17,0.71954999999999991,1]
[null,13188,"BOLÍVAR","CICUCO","BOLÍVAR - CICUCO",11147,5.8,3.5669999999999997,1]
[null,13212,"BOLÍVAR","CÓRDOBA","BOLÍVAR - CÓRDOBA",12266,2.2200000000000002,1.3653000000000002,1]
[null,13222,"BOLÍVAR","CLEMENCIA","BOLÍVAR - CLEMENCIA",12963,2.52,1.5498000000000001,1]
[null,13244,"BOLÍVAR","EL CARMEN DE BOLÍVAR","BOLÍVAR - EL CARMEN DE BOLÍVAR",78729,27.01,16.611150000000002,2]
[null,13248,"BOLÍVAR","EL GUAMO","BOLÍVAR - EL GUAMO",7762,1.97,1.2115499999999999,1]
[null,13268,"BOLÍVAR","EL PEÑÓN","BOLÍVAR - EL PEÑÓN",10328,2.06,1.2668999999999999,1]
[null,13300,"BOLÍVAR","HATILLO DE LOBA","BOLÍVAR - HATILLO DE LOBA",12270,1.93,1.1869499999999999,1]
[null,13430,"BOLÍVAR","MAGANGUÉ","BOLÍVAR - MAGANGUÉ",123982,40.75,25.061250000000001,2]
[null,13433,"BOLÍVAR","MAHATES","BOLÍVAR - MAHATES",27127,3.21,1.9741499999999998,1]
[null,13440,"BOLÍVAR","MARGARITA","BOLÍVAR - MARGARITA",10246,0.4,0.246,1]
[null,13442,"BOLÍVAR","MARÍA LA BAJA","BOLÍVAR - MARÍA LA BAJA",49462,6.41,3.9421499999999998,1]
[null,13458,"BOLÍVAR","MONTECRISTO","BOLÍVAR - MONTECRISTO",23318,5.5,3.3824999999999998,1]
[null,13468,"BOLÍVAR","SANTA CRUZ DE MOMPOX","BOLÍVAR - SANTA CRUZ DE MOMPOX",45417,5.8,3.5669999999999997,1]
[null,13473,"BOLÍVAR","MORALES","BOLÍVAR - MORALES",22487,0.85,0.52274999999999994,1]
[null,13490,"BOLÍVAR","NOROSÍ","BOLÍVAR - NOROSÍ",5088,1.1499999999999999,0.70724999999999993,1]
[null,13549,"BOLÍVAR","PINILLOS",{"$f":"C196&\" - \"&D196","v":"BOLÍVAR - PINILLOS"},25964,6.57,4.0405500000000005,{"$f":"IF(H196<$P$3,$O$3,IF(H196<$P$4,$O$4,IF(H196<$P$5,$O$5,$O$6)))","v":1}]
[null,13580,"BOLÍVAR","REGIDOR","BOLÍVAR - REGIDOR",11306,0.46,0.28289999999999998,1]
[null,13600,"BOLÍVAR","RÍO VIEJO","BOLÍVAR - RÍO VIEJO",19282,0.25,0.15375,1]
[null,13620,"BOLÍVAR","SAN CRISTÓBAL","BOLÍVAR - SAN CRISTÓBAL",6732,2.25,1.38375,1]
[null,13647,"BOLÍVAR","SAN ESTANISLAO","BOLÍVAR - SAN ESTANISLAO",16670,5.01,3.0811499999999996,1]
[null,13650,"BOLÍVAR","SAN FERNANDO","BOLÍVAR - SAN FERNANDO",14130,3.37,2.0725500000000001,1]
[null,13654,"BOLÍVAR","SAN JACINTO","BOLÍVAR - SAN JACINTO",21644,16.829999999999998,10.350449999999999,2]
[null,13655,"BOLÍVAR","SAN JACINTO DEL CAUCA","BOLÍVAR - SAN JACINTO DEL CAUCA",14665,3.15,1.9372499999999999,1]
[null,13657,"BOLÍVAR","SAN JUAN NEPOMUCENO","BOLÍVAR - SAN JUAN NEPOMUCENO",34012,24.25,14.91375,2]
[null,13667,"BOLÍVAR","SAN MARTÍN DE LOBA","BOLÍVAR - SAN MARTÍN DE LOBA",18891,2.25,1.38375,1]
[null,13670,"BOLÍVAR","SAN PABLO","BOLÍVAR - SAN PABLO",36341,13.14,8.0811000000000011,1]
[null,13673,"BOLÍVAR","SANTA CATALINA","BOLÍVAR - SANTA CATALINA",13677,6.31,3.8806499999999997,1]
[null,13683,"BOLÍVAR","SANTA ROSA","BOLÍVAR - SANTA ROSA",24694,10.029999999999999,6.1684499999999991,1]
[null,13688,"BOLÍVAR","SANTA ROSA DEL SUR","BOLÍVAR - SANTA ROSA DEL SUR",46017,6.45,3.9667500000000002,1]
[null,13744,"BOLÍVAR","SIMITÍ","BOLÍVAR - SIMITÍ",21620,4.45,2.7367500000000002,1]
[null,13760,"BOLÍVAR","SOPLAVIENTO","BOLÍVAR - SOPLAVIENTO",8508,2.81,1.7281500000000001,1]
[null,13780,"BOLÍVAR","TALAIGUA NUEVO","BOLÍVAR - TALAIGUA NUEVO",11479,2.72,1.6728000000000001,1]
[null,13810,"BOLÍVAR","TIQUISIO","BOLÍVAR - TIQUISIO",23859,9.2200000000000006,5.6703000000000001,1]
[null,13836,"BOLÍVAR","TURBACO","BOLÍVAR - TURBACO",76218,64.349999999999994,39.575249999999997,2]
[null,13838,"BOLÍVAR","TURBANÁ","BOLÍVAR - TURBANÁ",15505,8.5500000000000007,5.2582500000000003,1]
[null,13873,"BOLÍVAR","VILLANUEVA","BOLÍVAR - VILLANUEVA",20624,6.99,4.2988499999999998,1]
[null,13894,"BOLÍVAR","ZAMBRANO","BOLÍVAR - ZAMBRANO",11923,5.84,3.5915999999999997,1]
[null,15001,"BOYACÁ","TUNJA","BOYACÁ - TUNJA",202996,140.63999999999999,86.493599999999986,3]
[null,15022,"BOYACÁ","ALMEIDA","BOYACÁ - ALMEIDA",1558,0.06,3.6899999999999995E-2,1]
[null,15047,"BOYACÁ","AQUITANIA","BOYACÁ - AQUITANIA",14469,3.36,2.0663999999999998,1]
[null,15051,"BOYACÁ","ARCABUCO","BOYACÁ - ARCABUCO",5249,0.78,0.47970000000000002,1]
[null,15087,"BOYACÁ","BELÉN","BOYACÁ - BELÉN",6820,1.46,0.89789999999999992,1]
[null,15090,"BOYACÁ","BERBEO","BOYACÁ - BERBEO",1941,0.09,5.5349999999999996E-2,1]
[null,15092,"BOYACÁ","BETÉITIVA","BOYACÁ - BETÉITIVA",1887,0.1,6.1499999999999999E-2,1]
[null,15097,"BOYACÁ","BOAVITA","BOYACÁ - BOAVITA",6442,0.57999999999999996,0.35669999999999996,1]
[null,15104,"BOYACÁ","BOYACÁ","BOYACÁ - BOYACÁ",4231,0.24,0.14759999999999998,1]
[null,15106,"BOYACÁ","BRICEÑO","BOYACÁ - BRICEÑO",2516,0.18,0.11069999999999999,1]
[null,15109,"BOYACÁ","BUENAVISTA","BOYACÁ - BUENAVISTA",5738,0.33,0.20295000000000002,1]
[null,15114,"BOYACÁ","BUSBANZÁ","BOYACÁ - BUSBANZÁ",1288,0.03,1.8449999999999998E-2,1]
[null,15131,"BOYACÁ","CALDAS","BOYACÁ - CALDAS",3471,0.11,6.7650000000000002E-2,1]
[null,15135,"BOYACÁ","CAMPOHERMOSO","BOYACÁ - CAMPOHERMOSO",3735,0.27,0.16605,1]
[null,15162,"BOYACÁ","CERINZA","BOYACÁ - CERINZA",3544,0.63,0.38745000000000002,1]
[null,15172,"BOYACÁ","CHINAVITA","BOYACÁ - CHINAVITA",3404,0.35,0.21525,1]
[null,15176,"BOYACÁ","CHIQUINQUIRÁ","BOYACÁ - CHIQUINQUIRÁ",69121,36.76,22.607399999999998,2]
[null,15180,"BOYACÁ","CHISCAS","BOYACÁ - CHISCAS",3906,0.26,0.15990000000000001,1]
[null,15183,"BOYACÁ","CHITA","BOYACÁ - CHITA",9053,0.71,0.43664999999999998,1]
[null,15185,"BOYACÁ","CHITARAQUE","BOYACÁ - CHITARAQUE",5298,0.46,0.28289999999999998,1]
[null,15187,"BOYACÁ","CHIVATÁ","BOYACÁ - CHIVATÁ",6717,1.81,1.1131500000000001,1]
[null,15189,"BOYACÁ","CIÉNEGA","BOYACÁ - CIÉNEGA",4498,0.44,0.27060000000000001,1]
[null,15204,"BOYACÁ","CÓMBITA","BOYACÁ - CÓMBITA",15350,0.81,0.49815000000000004,1]
[null,15212,"BOYACÁ","COPER","BOYACÁ - COPER",3455,0.17,0.10455,1]
[null,15215,"BOYACÁ","CORRALES","BOYACÁ - CORRALES",2180,0.28999999999999998,0.17834999999999998,1]
[null,15218,"BOYACÁ","COVARACHÍA","BOYACÁ - COVARACHÍA",2702,0.44,0.27060000000000001,1]
[null,15223,"BOYACÁ","CUBARÁ","BOYACÁ - CUBARÁ",6741,0.63,0.38745000000000002,1]
[null,15224,"BOYACÁ","CUCAITA","BOYACÁ - CUCAITA",4709,0.57999999999999996,0.35669999999999996,1]
[null,15226,"BOYACÁ","CUÍTIVA","BOYACÁ - CUÍTIVA",1846,0.36,0.22139999999999999,1]
[null,15232,"BOYACÁ","CHÍQUIZA","BOYACÁ - CHÍQUIZA",5256,0.09,5.5349999999999996E-2,1]
[null,15236,"BOYACÁ","CHIVOR","BOYACÁ - CHIVOR",1646,0.13,7.9950000000000007E-2,1]
[null,15238,"BOYACÁ","DUITAMA","BOYACÁ - DUITAMA",114413,44.02,27.072300000000002,2]
[null,15244,"BOYACÁ","EL COCUY","BOYACÁ - EL COCUY",5085,0.59,0.36284999999999995,1]
[null,15248,"BOYACÁ","EL ESPINO","BOYACÁ - EL ESPINO",4226,0.83,0.51044999999999996,1]
[null,15272,"BOYACÁ","FIRAVITOBA","BOYACÁ - FIRAVITOBA",5732,0.84,0.51659999999999995,1]
[null,15276,"BOYACÁ","FLORESTA","BOYACÁ - FLORESTA",4333,0.67,0.41205000000000003,1]
[null,15293,"BOYACÁ","GACHANTIVÁ","BOYACÁ - GACHANTIVÁ",2497,0.16,9.8400000000000001E-2,1]
[null,15296,"BOYACÁ","GÁMEZA","BOYACÁ - GÁMEZA",4551,0.34,0.20910000000000001,1]
[null,15299,"BOYACÁ","GARAGOA","BOYACÁ - GARAGOA",17079,4.53,2.7859500000000001,1]
[null,15317,"BOYACÁ","GUACAMAYAS","BOYACÁ - GUACAMAYAS",1544,0.15,9.2249999999999999E-2,1]
[null,15322,"BOYACÁ","GUATEQUE","BOYACÁ - GUATEQUE",9360,4.97,3.0565499999999997,1]
[null,15325,"BOYACÁ","GUAYATÁ","BOYACÁ - GUAYATÁ",4660,0.3,0.1845,1]
[null,15332,"BOYACÁ","GÜICÁN DE LA SIERRA",{"$f":"C260&\" - \"&D260","v":"BOYACÁ - GÜICÁN DE LA SIERRA"},6506,0.45,0.27675,{"$f":"IF(H260<$P$3,$O$3,IF(H260<$P$4,$O$4,IF(H260<$P$5,$O$5,$O$6)))","v":1}]
[null,15362,"BOYACÁ","IZA","BOYACÁ - IZA",2440,0.51,0.31364999999999998,1]
[null,15367,"BOYACÁ","JENESANO","BOYACÁ - JENESANO",7705,0.98,0.60270000000000001,1]
[null,15368,"BOYACÁ","JERICÓ","BOYACÁ - JERICÓ",3751,0.3,0.1845,1]
[null,15377,"BOYACÁ","LABRANZAGRANDE","BOYACÁ - LABRANZAGRANDE",4967,0.53,0.32595000000000002,1]
[null,15380,"BOYACÁ","LA CAPILLA","BOYACÁ - LA CAPILLA",2359,0.2,0.123,1]
[null,15401,"BOYACÁ","LA VICTORIA","BOYACÁ - LA VICTORIA",1673,0.15,9.2249999999999999E-2,1]
[null,15403,"BOYACÁ","LA UVITA","BOYACÁ - LA UVITA",2173,0.48,0.29519999999999996,1]
[null,15407,"BOYACÁ","VILLA DE LEYVA","BOYACÁ - VILLA DE LEYVA",18606,10.68,6.5682,1]
[null,15425,"BOYACÁ","MACANAL","BOYACÁ - MACANAL",4842,0.46,0.28289999999999998,1]
[null,15442,"BOYACÁ","MARIPÍ","BOYACÁ - MARIPÍ",7293,0.32,0.1968,1]
[null,15455,"BOYACÁ","MIRAFLORES","BOYACÁ - MIRAFLORES",9802,1.84,1.1315999999999999,1]
[null,15464,"BOYACÁ","MONGUA","BOYACÁ - MONGUA",4495,0.16,9.8400000000000001E-2,1]
[null,15466,"BOYACÁ","MONGUÍ","BOYACÁ - MONGUÍ",4982,0.55000000000000004,0.33825,1]
[null,15469,"BOYACÁ","MONIQUIRÁ","BOYACÁ - MONIQUIRÁ",21182,9.3699999999999992,5.7625499999999992,1]
[null,15476,"BOYACÁ","MOTAVITA","BOYACÁ - MOTAVITA",8607,0.28999999999999998,0.17834999999999998,1]
[null,15480,"BOYACÁ","MUZO","BOYACÁ - MUZO",8548,3.78,2.3247,1]
[null,15491,"BOYACÁ","NOBSA","BOYACÁ - NOBSA",16612,5.0199999999999996,3.0872999999999995,1]
[null,15494,"BOYACÁ","NUEVO COLÓN","BOYACÁ - NUEVO COLÓN",6729,0.26,0.15990000000000001,1]
[null,15500,"BOYACÁ","OICATÁ","BOYACÁ - OICATÁ",2833,0.25,0.15375,1]
[null,15507,"BOYACÁ","OTANCHE","BOYACÁ - OTANCHE",10696,2.69,1.65435,1]
[null,15511,"BOYACÁ","PACHAVITA","BOYACÁ - PACHAVITA",2287,0.09,5.5349999999999996E-2,1]
[null,15514,"BOYACÁ","PÁEZ","BOYACÁ - PÁEZ",2741,0.28999999999999998,0.17834999999999998,1]
[null,15516,"BOYACÁ","PAIPA","BOYACÁ - PAIPA",31868,15.57,9.5755499999999998,1]
[null,15518,"BOYACÁ","PAJARITO","BOYACÁ - PAJARITO",1487,0.04,2.46E-2,1]
[null,15522,"BOYACÁ","PANQUEBA","BOYACÁ - PANQUEBA",1359,0.18,0.11069999999999999,1]
[null,15531,"BOYACÁ","PAUNA","BOYACÁ - PAUNA",10825,0.72,0.44279999999999997,1]
[null,15533,"BOYACÁ","PAYA","BOYACÁ - PAYA",2495,0.17,0.10455,1]
[null,15537,"BOYACÁ","PAZ DE RÍO","BOYACÁ - PAZ DE RÍO",4443,0.78,0.47970000000000002,1]
[null,15542,"BOYACÁ","PESCA","BOYACÁ - PESCA",7374,0.91,0.55964999999999998,1]
[null,15550,"BOYACÁ","PISBA","BOYACÁ - PISBA",1262,7.0000000000000007E-2,4.3050000000000005E-2,1]
[null,15572,"BOYACÁ","PUERTO BOYACÁ","BOYACÁ - PUERTO BOYACÁ",56930,23.35,14.360250000000001,2]
[null,15580,"BOYACÁ","QUÍPAMA","BOYACÁ - QUÍPAMA",7485,0.28000000000000003,0.17220000000000002,1]
[null,15599,"BOYACÁ","RAMIRIQUÍ","BOYACÁ - RAMIRIQUÍ",9679,2.59,1.5928499999999999,1]
[null,15600,"BOYACÁ","RÁQUIRA","BOYACÁ - RÁQUIRA",14037,1.25,0.76875000000000004,1]
[null,15621,"BOYACÁ","RONDÓN","BOYACÁ - RONDÓN",2751,0.24,0.14759999999999998,1]
[null,15632,"BOYACÁ","SABOYÁ","BOYACÁ - SABOYÁ",12119,4.6399999999999997,2.8535999999999997,1]
[null,15638,"BOYACÁ","SÁCHICA","BOYACÁ - SÁCHICA",3746,1.26,0.77490000000000003,1]
[null,15646,"BOYACÁ","SAMACÁ","BOYACÁ - SAMACÁ",20767,6.02,3.7022999999999997,1]
[null,15660,"BOYACÁ","SAN EDUARDO","BOYACÁ - SAN EDUARDO",1850,0.15,9.2249999999999999E-2,1]
[null,15664,"BOYACÁ","SAN JOSÉ DE PARE","BOYACÁ - SAN JOSÉ DE PARE",4955,0.31,0.19064999999999999,1]
[null,15667,"BOYACÁ","SAN LUIS DE GACENO","BOYACÁ - SAN LUIS DE GACENO",4667,1.1200000000000001,0.68880000000000008,1]
[null,15673,"BOYACÁ","SAN MATEO","BOYACÁ - SAN MATEO",3304,0.27,0.16605,1]
[null,15676,"BOYACÁ","SAN MIGUEL DE SEMA","BOYACÁ - SAN MIGUEL DE SEMA",4522,0.31,0.19064999999999999,1]
[null,15681,"BOYACÁ","SAN PABLO DE BORBUR","BOYACÁ - SAN PABLO DE BORBUR",10341,0.59,0.36284999999999995,1]
[null,15686,"BOYACÁ","SANTANA","BOYACÁ - SANTANA",7605,1.57,0.96555000000000002,1]
[null,15690,"BOYACÁ","SANTA MARÍA","BOYACÁ - SANTA MARÍA",3730,0.78,0.47970000000000002,1]
[null,15693,"BOYACÁ","SANTA ROSA DE VITERBO","BOYACÁ - SANTA ROSA DE VITERBO",13402,3.06,1.8818999999999999,1]
[null,15696,"BOYACÁ","SANTA SOFÍA","BOYACÁ - SANTA SOFÍA",2552,0.56000000000000005,0.34440000000000004,1]
[null,15720,"BOYACÁ","SATIVANORTE","BOYACÁ - SATIVANORTE",2177,0.16,9.8400000000000001E-2,1]
[null,15723,"BOYACÁ","SATIVASUR","BOYACÁ - SATIVASUR",1021,0.19,0.11685,1]
[null,15740,"BOYACÁ","SIACHOQUE","BOYACÁ - SIACHOQUE",8973,0.48,0.29519999999999996,1]
[null,15753,"BOYACÁ","SOATÁ","BOYACÁ - SOATÁ",6541,3.66,2.2509000000000001,1]
[null,15755,"BOYACÁ","SOCOTÁ","BOYACÁ - SOCOTÁ",7353,0.32,0.1968,1]
[null,15757,"BOYACÁ","SOCHA","BOYACÁ - SOCHA",6924,1.06,0.65190000000000003,1]
[null,15759,"BOYACÁ","SOGAMOSO","BOYACÁ - SOGAMOSO",111336,76.91,47.29965,2]
[null,15761,"BOYACÁ","SOMONDOCO","BOYACÁ - SOMONDOCO",3342,0.32,0.1968,1]
[null,15762,"BOYACÁ","SORA","BOYACÁ - SORA",3030,0.19,0.11685,1]
[null,15763,"BOYACÁ","SOTAQUIRÁ","BOYACÁ - SOTAQUIRÁ",7224,0.72,0.44279999999999997,1]
[null,15764,"BOYACÁ","SORACÁ","BOYACÁ - SORACÁ",5109,0.59,0.36284999999999995,1]
[null,15774,"BOYACÁ","SUSACÓN","BOYACÁ - SUSACÓN",2861,0.14000000000000001,8.610000000000001E-2,1]
[null,15776,"BOYACÁ","SUTAMARCHÁN","BOYACÁ - SUTAMARCHÁN",5802,1.9,1.1684999999999999,1]
[null,15778,"BOYACÁ","SUTATENZA","BOYACÁ - SUTATENZA",3894,0.16,9.8400000000000001E-2,1]
[null,15790,"BOYACÁ","TASCO","BOYACÁ - TASCO",6117,0.76,0.46739999999999998,1]
[null,15798,"BOYACÁ","TENZA",{"$f":"C324&\" - \"&D324","v":"BOYACÁ - TENZA"},3888,0.73,0.44894999999999996,{"$f":"IF(H324<$P$3,$O$3,IF(H324<$P$4,$O$4,IF(H324<$P$5,$O$5,$O$6)))","v":1}]
[null,15804,"BOYACÁ","TIBANÁ","BOYACÁ - TIBANÁ",8964,1.04,0.63960000000000006,1]
[null,15806,"BOYACÁ","TIBASOSA","BOYACÁ - TIBASOSA",14602,3.13,1.9249499999999999,1]
[null,15808,"BOYACÁ","TINJACÁ","BOYACÁ - TINJACÁ",3045,0.54,0.33210000000000001,1]
[null,15810,"BOYACÁ","TIPACOQUE","BOYACÁ - TIPACOQUE",2969,0.28000000000000003,0.17220000000000002,1]
[null,15814,"BOYACÁ","TOCA","BOYACÁ - TOCA",9961,2,1.23,1]
[null,15816,"BOYACÁ","TOGÜÍ","BOYACÁ - TOGÜÍ",4818,0.19,0.11685,1]
[null,15820,"BOYACÁ","TÓPAGA","BOYACÁ - TÓPAGA",3691,0.31,0.19064999999999999,1]
[null,15822,"BOYACÁ","TOTA","BOYACÁ - TOTA",5224,0.44,0.27060000000000001,1]
[null,15832,"BOYACÁ","TUNUNGUÁ","BOYACÁ - TUNUNGUÁ",1934,0.09,5.5349999999999996E-2,1]
[null,15835,"BOYACÁ","TURMEQUÉ","BOYACÁ - TURMEQUÉ",5662,0.61,0.37514999999999998,1]
[null,15837,"BOYACÁ","TUTA","BOYACÁ - TUTA",9916,2.02,1.2423,1]
[null,15839,"BOYACÁ","TUTAZÁ","BOYACÁ - TUTAZÁ",1758,7.0000000000000007E-2,4.3050000000000005E-2,1]
[null,15842,"BOYACÁ","ÚMBITA","BOYACÁ - ÚMBITA",10337,0.49,0.30135000000000001,1]
[null,15861,"BOYACÁ","VENTAQUEMADA","BOYACÁ - VENTAQUEMADA",15827,2.65,1.62975,1]
[null,15879,"BOYACÁ","VIRACACHÁ","BOYACÁ - VIRACACHÁ",3118,0.09,5.5349999999999996E-2,1]
[null,15897,"BOYACÁ","ZETAQUIRA","BOYACÁ - ZETAQUIRA",4326,0.37,0.22755,1]
[null,17001,"CALDAS","MANIZALES","CALDAS - MANIZALES",401398,413.39,254.23484999999999,3]
[null,17013,"CALDAS","AGUADAS","CALDAS - AGUADAS",21237,8.65,5.31975,1]
[null,17042,"CALDAS","ANSERMA","CALDAS - ANSERMA",33272,13.37,8.22255,1]
[null,17050,"CALDAS","ARANZAZU","CALDAS - ARANZAZU",10904,3.18,1.9557,1]
[null,17088,"CALDAS","BELALCÁZAR","CALDAS - BELALCÁZAR",10448,3.4,2.0909999999999997,1]
[null,17174,"CALDAS","CHINCHINÁ","CALDAS - CHINCHINÁ",50673,32.479999999999997,19.975199999999997,2]
[null,17272,"CALDAS","FILADELFIA","CALDAS - FILADELFIA",10389,2.4700000000000002,1.51905,1]
[null,17380,"CALDAS","LA DORADA","CALDAS - LA DORADA",78540,45.62,28.056299999999997,2]
[null,17388,"CALDAS","LA MERCED","CALDAS - LA MERCED",5057,2.37,1.4575500000000001,1]
[null,17433,"CALDAS","MANZANARES","CALDAS - MANZANARES",22623,4.01,2.4661499999999998,1]
[null,17442,"CALDAS","MARMATO","CALDAS - MARMATO",9363,2.69,1.65435,1]
[null,17444,"CALDAS","MARQUETALIA","CALDAS - MARQUETALIA",15011,3.17,1.9495499999999999,1]
[null,17446,"CALDAS","MARULANDA","CALDAS - MARULANDA",3379,0.25,0.15375,1]
[null,17486,"CALDAS","NEIRA","CALDAS - NEIRA",31399,6.36,3.9114,1]
[null,17495,"CALDAS","NORCASIA","CALDAS - NORCASIA",6175,1.89,1.16235,1]
[null,17513,"CALDAS","PÁCORA","CALDAS - PÁCORA",10863,5.25,3.2287499999999998,1]
[null,17524,"CALDAS","PALESTINA","CALDAS - PALESTINA",17597,13.7,8.4254999999999995,1]
[null,17541,"CALDAS","PENSILVANIA","CALDAS - PENSILVANIA",26342,3.55,2.1832499999999997,1]
[null,17614,"CALDAS","RIOSUCIO","CALDAS - RIOSUCIO",64593,13.7,8.4254999999999995,1]
[null,17616,"CALDAS","RISARALDA","CALDAS - RISARALDA",9153,3.18,1.9557,1]
[null,17653,"CALDAS","SALAMINA","CALDAS - SALAMINA",15389,6.29,3.86835,1]
[null,17662,"CALDAS","SAMANÁ","CALDAS - SAMANÁ",25798,3.54,2.1770999999999998,1]
[null,17665,"CALDAS","SAN JOSÉ","CALDAS - SAN JOSÉ",7593,0.59,0.36284999999999995,1]
[null,17777,"CALDAS","SUPÍA","CALDAS - SUPÍA",27489,10.67,6.5620500000000002,1]
[null,17867,"CALDAS","VICTORIA","CALDAS - VICTORIA",8020,2.14,1.3161,1]
[null,17873,"CALDAS","VILLAMARÍA","CALDAS - VILLAMARÍA",60729,36.93,22.711949999999998,2]
[null,17877,"CALDAS","VITERBO","CALDAS - VITERBO",12388,8,4.92,1]
[null,18001,"CAQUETÁ","FLORENCIA","CAQUETÁ - FLORENCIA",184510,118.91,73.129649999999998,3]
[null,18029,"CAQUETÁ","ALBANIA","CAQUETÁ - ALBANIA",6432,1.06,0.65190000000000003,1]
[null,18094,"CAQUETÁ","BELÉN DE LOS ANDAQUÍES","CAQUETÁ - BELÉN DE LOS ANDAQUÍES",11780,3.13,1.9249499999999999,1]
[null,18150,"CAQUETÁ","CARTAGENA DEL CHAIRÁ","CAQUETÁ - CARTAGENA DEL CHAIRÁ",35473,6.62,4.0712999999999999,1]
[null,18205,"CAQUETÁ","CURILLO","CAQUETÁ - CURILLO",11880,1.92,1.1807999999999998,1]
[null,18247,"CAQUETÁ","EL DONCELLO","CAQUETÁ - EL DONCELLO",22306,9.41,5.7871499999999996,1]
[null,18256,"CAQUETÁ","EL PAUJÍL","CAQUETÁ - EL PAUJÍL",21462,4.5199999999999996,2.7797999999999998,1]
[null,18410,"CAQUETÁ","LA MONTAÑITA","CAQUETÁ - LA MONTAÑITA",24323,2.35,1.4452499999999999,1]
[null,18460,"CAQUETÁ","MILÁN","CAQUETÁ - MILÁN",11860,2.0699999999999998,1.2730499999999998,1]
[null,18479,"CAQUETÁ","MORELIA","CAQUETÁ - MORELIA",3924,1.29,0.79335,1]
[null,18592,"CAQUETÁ","PUERTO RICO","CAQUETÁ - PUERTO RICO",33701,13.27,8.1610499999999995,1]
[null,18610,"CAQUETÁ","SAN JOSÉ DEL FRAGUA","CAQUETÁ - SAN JOSÉ DEL FRAGUA",15315,3.12,1.9188000000000001,1]
[null,18753,"CAQUETÁ","SAN VICENTE DEL CAGUÁN","CAQUETÁ - SAN VICENTE DEL CAGUÁN",72949,13.35,8.2102500000000003,1]
[null,18756,"CAQUETÁ","SOLANO","CAQUETÁ - SOLANO",25546,1.93,1.1869499999999999,1]
[null,18785,"CAQUETÁ","SOLITA","CAQUETÁ - SOLITA",9130,1.57,0.96555000000000002,1]
[null,18860,"CAQUETÁ","VALPARAÍSO","CAQUETÁ - VALPARAÍSO",11819,1.03,0.63344999999999996,1]
[null,85001,"CASANARE","YOPAL","CASANARE - YOPAL",152655,123.46,75.927899999999994,3]
[null,85010,"CASANARE","AGUAZUL","CASANARE - AGUAZUL",43183,16.91,10.399649999999999,2]
[null,85015,"CASANARE","CHÁMEZA","CASANARE - CHÁMEZA",2646,0.28000000000000003,0.17220000000000002,1]
[null,85125,"CASANARE","HATO COROZAL","CASANARE - HATO COROZAL",13020,2.0499999999999998,1.2607499999999998,1]
[null,85136,"CASANARE","LA SALINA",{"$f":"C388&\" - \"&D388","v":"CASANARE - LA SALINA"},1480,0.11,6.7650000000000002E-2,{"$f":"IF(H388<$P$3,$O$3,IF(H388<$P$4,$O$4,IF(H388<$P$5,$O$5,$O$6)))","v":1}]
[null,85139,"CASANARE","MANÍ","CASANARE - MANÍ",11121,0.16,9.8400000000000001E-2,1]
[null,85162,"CASANARE","MONTERREY","CASANARE - MONTERREY",15585,5.8,3.5669999999999997,1]
[null,85225,"CASANARE","NUNCHÍA","CASANARE - NUNCHÍA",8972,1.3,0.79949999999999999,1]
[null,85230,"CASANARE","OROCUÉ","CASANARE - OROCUÉ",8460,2.4300000000000002,1.4944500000000001,1]
[null,85250,"CASANARE","PAZ DE ARIPORO","CASANARE - PAZ DE ARIPORO",26237,13.56,8.3393999999999995,1]
[null,85263,"CASANARE","PORE","CASANARE - PORE",7917,3.36,2.0663999999999998,1]
[null,85279,"CASANARE","RECETOR","CASANARE - RECETOR",4683,0.11,6.7650000000000002E-2,1]
[null,85300,"CASANARE","SABANALARGA","CASANARE - SABANALARGA",2806,0.74,0.4551,1]
[null,85315,"CASANARE","SÁCAMA","CASANARE - SÁCAMA",2107,0.99,0.60885,1]
[null,85325,"CASANARE","SAN LUIS DE PALENQUE","CASANARE - SAN LUIS DE PALENQUE",7951,1.88,1.1561999999999999,1]
[null,85400,"CASANARE","TÁMARA","CASANARE - TÁMARA",7031,0.56999999999999995,0.35054999999999997,1]
[null,85410,"CASANARE","TAURAMENA","CASANARE - TAURAMENA",24747,12.83,7.8904499999999995,1]
[null,85430,"CASANARE","TRINIDAD","CASANARE - TRINIDAD",16213,3.1,1.9065000000000001,1]
[null,85440,"CASANARE","VILLANUEVA","CASANARE - VILLANUEVA",24740,15.78,9.704699999999999,1]
[null,19001,"CAUCA","POPAYÁN","CAUCA - POPAYÁN",286724,218.11,134.13765000000001,3]
[null,19022,"CAUCA","ALMAGUER","CAUCA - ALMAGUER",21374,0.09,5.5349999999999996E-2,1]
[null,19050,"CAUCA","ARGELIA","CAUCA - ARGELIA",27670,1.37,0.84255000000000002,1]
[null,19075,"CAUCA","BALBOA","CAUCA - BALBOA",26384,3.34,2.0541,1]
[null,19100,"CAUCA","BOLÍVAR","CAUCA - BOLÍVAR",44868,2.61,1.6051499999999999,1]
[null,19110,"CAUCA","BUENOS AIRES","CAUCA - BUENOS AIRES",34631,0.45,0.27675,1]
[null,19130,"CAUCA","CAJIBÍO","CAUCA - CAJIBÍO",38703,1.28,0.78720000000000001,1]
[null,19137,"CAUCA","CALDONO","CAUCA - CALDONO",34132,1.38,0.8486999999999999,1]
[null,19142,"CAUCA","CALOTO","CAUCA - CALOTO",17747,3.98,2.4476999999999998,1]
[null,19212,"CAUCA","CORINTO","CAUCA - CORINTO",33489,4.74,2.9151000000000002,1]
[null,19256,"CAUCA","EL TAMBO","CAUCA - EL TAMBO",48094,2.5099999999999998,1.5436499999999997,1]
[null,19290,"CAUCA","FLORENCIA","CAUCA - FLORENCIA",6190,0.44,0.27060000000000001,1]
[null,19300,"CAUCA","GUACHENÉ","CAUCA - GUACHENÉ",19933,3.97,2.4415499999999999,1]
[null,19318,"CAUCA","GUAPI","CAUCA - GUAPI",29989,6.98,4.2927,1]
[null,19355,"CAUCA","INZÁ","CAUCA - INZÁ",32582,1.38,0.8486999999999999,1]
[null,19364,"CAUCA","JAMBALÓ","CAUCA - JAMBALÓ",19018,0.62,0.38129999999999997,1]
[null,19392,"CAUCA","LA SIERRA","CAUCA - LA SIERRA",10555,0.68,0.41820000000000002,1]
[null,19397,"CAUCA","LA VEGA","CAUCA - LA VEGA",47417,0.42,0.25829999999999997,1]
[null,19418,"CAUCA","LÓPEZ DE MICAY","CAUCA - LÓPEZ DE MICAY",20867,0.98,0.60270000000000001,1]
[null,19450,"CAUCA","MERCADERES","CAUCA - MERCADERES",18247,2.3199999999999998,1.4267999999999998,1]
[null,19455,"CAUCA","MIRANDA","CAUCA - MIRANDA",42639,9.6300000000000008,5.9224500000000004,1]
[null,19473,"CAUCA","MORALES","CAUCA - MORALES",26707,1.5,0.92249999999999999,1]
[null,19513,"CAUCA","PADILLA","CAUCA - PADILLA",7686,1.1599999999999999,0.71339999999999992,1]
[null,19517,"CAUCA","PÁEZ","CAUCA - PÁEZ",36628,0.61,0.37514999999999998,1]
[null,19532,"CAUCA","PATÍA","CAUCA - PATÍA",37504,8.26,5.0798999999999994,1]
[null,19533,"CAUCA","PIAMONTE","CAUCA - PIAMONTE",7470,1.92,1.1807999999999998,1]
[null,19548,"CAUCA","PIENDAMÓ - TUNÍA","CAUCA - PIENDAMÓ - TUNÍA",46163,9.56,5.8794000000000004,1]
[null,19573,"CAUCA","PUERTO TEJADA","CAUCA - PUERTO TEJADA",46166,29.01,17.841149999999999,2]
[null,19585,"CAUCA","PURACÉ","CAUCA - PURACÉ",15272,0.46,0.28289999999999998,1]
[null,19622,"CAUCA","ROSAS","CAUCA - ROSAS",13614,1.24,0.76259999999999994,1]
[null,19693,"CAUCA","SAN SEBASTIÁN","CAUCA - SAN SEBASTIÁN",14432,0.48,0.29519999999999996,1]
[null,19698,"CAUCA","SANTANDER DE QUILICHAO","CAUCA - SANTANDER DE QUILICHAO",99354,41.15,25.30725,2]
[null,19701,"CAUCA","SANTA ROSA","CAUCA - SANTA ROSA",10872,0.24,0.14759999999999998,1]
[null,19743,"CAUCA","SILVIA","CAUCA - SILVIA",32692,2.44,1.5005999999999999,1]
[null,19760,"CAUCA","SOTARÁ PAISPAMBA","CAUCA - SOTARÁ PAISPAMBA",17552,0.16,9.8400000000000001E-2,1]
[null,19780,"CAUCA","SUÁREZ","CAUCA - SUÁREZ",18404,2.23,1.3714500000000001,1]
[null,19785,"CAUCA","SUCRE","CAUCA - SUCRE",8867,0.56000000000000005,0.34440000000000004,1]
[null,19807,"CAUCA","TIMBÍO","CAUCA - TIMBÍO",35564,6.41,3.9421499999999998,1]
[null,19809,"CAUCA","TIMBIQUÍ","CAUCA - TIMBIQUÍ",22077,1.81,1.1131500000000001,1]
[null,19821,"CAUCA","TORIBÍO","CAUCA - TORIBÍO",30397,0.65,0.39974999999999999,1]
[null,19824,"CAUCA","TOTORÓ","CAUCA - TOTORÓ",21298,0.25,0.15375,1]
[null,19845,"CAUCA","VILLA RICA","CAUCA - VILLA RICA",16966,8.1199999999999992,4.9937999999999994,1]
[null,20001,"CESAR","VALLEDUPAR","CESAR - VALLEDUPAR",493367,386.34,237.59909999999999,3]
[null,20011,"CESAR","AGUACHICA","CESAR - AGUACHICA",96667,78.38,48.203699999999998,2]
[null,20013,"CESAR","AGUSTÍN CODAZZI","CESAR - AGUSTÍN CODAZZI",49233,29.83,18.34545,2]
[null,20032,"CESAR","ASTREA","CESAR - ASTREA",19389,9.1999999999999993,5.6579999999999995,1]
[null,20045,"CESAR","BECERRIL","CESAR - BECERRIL",13188,11.22,6.9003000000000005,1]
[null,20060,"CESAR","BOSCONIA","CESAR - BOSCONIA",39716,30.29,18.628349999999998,2]
[null,20175,"CESAR","CHIMICHAGUA","CESAR - CHIMICHAGUA",30303,0.93,0.57195000000000007,1]
[null,20178,"CESAR","CHIRIGUANÁ",{"$f":"C452&\" - \"&D452","v":"CESAR - CHIRIGUANÁ"},18574,8.61,5.2951499999999996,{"$f":"IF(H452<$P$3,$O$3,IF(H452<$P$4,$O$4,IF(H452<$P$5,$O$5,$O$6)))","v":1}]
[null,20228,"CESAR","CURUMANÍ","CESAR - CURUMANÍ",23018,18.84,11.586599999999999,2]
[null,20238,"CESAR","EL COPEY","CESAR - EL COPEY",26905,15.37,9.4525499999999987,1]
[null,20250,"CESAR","EL PASO","CESAR - EL PASO",23534,15.27,9.3910499999999999,1]
[null,20295,"CESAR","GAMARRA","CESAR - GAMARRA",17483,3.01,1.8511499999999999,1]
[null,20310,"CESAR","GONZÁLEZ","CESAR - GONZÁLEZ",6204,0.71,0.43664999999999998,1]
[null,20383,"CESAR","LA GLORIA","CESAR - LA GLORIA",12230,5.08,3.1242000000000001,1]
[null,20400,"CESAR","LA JAGUA DE IBIRICO","CESAR - LA JAGUA DE IBIRICO",22405,24.49,15.061349999999999,2]
[null,20443,"CESAR","MANAURE BALCÓN DEL CESAR","CESAR - MANAURE BALCÓN DEL CESAR",15905,4.4000000000000004,2.706,1]
[null,20517,"CESAR","PAILITAS","CESAR - PAILITAS",17545,5.78,3.5547,1]
[null,20550,"CESAR","PELAYA","CESAR - PELAYA",18334,10.15,6.2422500000000003,1]
[null,20570,"CESAR","PUEBLO BELLO","CESAR - PUEBLO BELLO",24572,4.75,2.9212500000000001,1]
[null,20614,"CESAR","RÍO DE ORO","CESAR - RÍO DE ORO",13845,3.19,1.9618499999999999,1]
[null,20621,"CESAR","LA PAZ","CESAR - LA PAZ",23025,12.96,7.9704000000000006,1]
[null,20710,"CESAR","SAN ALBERTO","CESAR - SAN ALBERTO",26551,13.32,8.1918000000000006,1]
[null,20750,"CESAR","SAN DIEGO","CESAR - SAN DIEGO",13147,6.47,3.97905,1]
[null,20770,"CESAR","SAN MARTÍN","CESAR - SAN MARTÍN",18930,10.59,6.5128500000000003,1]
[null,20787,"CESAR","TAMALAMEQUE","CESAR - TAMALAMEQUE",13700,2.19,1.3468499999999999,1]
[null,27001,"CHOCÓ","QUIBDÓ","CHOCÓ - QUIBDÓ",116256,74.91,46.069649999999996,2]
[null,27006,"CHOCÓ","ACANDÍ","CHOCÓ - ACANDÍ",9248,2.2400000000000002,1.3776000000000002,1]
[null,27025,"CHOCÓ","ALTO BAUDÓ","CHOCÓ - ALTO BAUDÓ",40733,5.79,3.5608499999999998,1]
[null,27050,"CHOCÓ","ATRATO","CHOCÓ - ATRATO",11045,24.96,15.3504,2]
[null,27073,"CHOCÓ","BAGADÓ","CHOCÓ - BAGADÓ",7895,0.77,0.47355000000000003,1]
[null,27075,"CHOCÓ","BAHÍA SOLANO","CHOCÓ - BAHÍA SOLANO",9425,0.31,0.19064999999999999,1]
[null,27077,"CHOCÓ","BAJO BAUDÓ","CHOCÓ - BAJO BAUDÓ",17836,0.86,0.52890000000000004,1]
[null,27099,"CHOCÓ","BOJAYÁ","CHOCÓ - BOJAYÁ",10123,3.39,2.0848499999999999,1]
[null,27135,"CHOCÓ","EL CANTÓN DEL SAN PABLO","CHOCÓ - EL CANTÓN DEL SAN PABLO",8798,1.26,0.77490000000000003,1]
[null,27150,"CHOCÓ","CARMEN DEL DARIÉN","CHOCÓ - CARMEN DEL DARIÉN",5583,0.38,0.23369999999999999,1]
[null,27160,"CHOCÓ","CÉRTEGUI","CHOCÓ - CÉRTEGUI",10234,1.03,0.63344999999999996,1]
[null,27205,"CHOCÓ","CONDOTO","CHOCÓ - CONDOTO",15334,4.67,2.8720499999999998,1]
[null,27245,"CHOCÓ","EL CARMEN DE ATRATO","CHOCÓ - EL CARMEN DE ATRATO",15015,1.87,1.15005,1]
[null,27250,"CHOCÓ","EL LITORAL DEL SAN JUAN","CHOCÓ - EL LITORAL DEL SAN JUAN",16829,0.59,0.36284999999999995,1]
[null,27361,"CHOCÓ","ISTMINA","CHOCÓ - ISTMINA",25981,17.78,10.934700000000001,2]
[null,27372,"CHOCÓ","JURADÓ","CHOCÓ - JURADÓ",3217,0.8,0.49199999999999999,1]
[null,27413,"CHOCÓ","LLORÓ","CHOCÓ - LLORÓ",11546,1.4,0.86099999999999999,1]
[null,27425,"CHOCÓ","MEDIO ATRATO","CHOCÓ - MEDIO ATRATO",33542,0.11,6.7650000000000002E-2,1]
[null,27430,"CHOCÓ","MEDIO BAUDÓ","CHOCÓ - MEDIO BAUDÓ",14347,0.61,0.37514999999999998,1]
[null,27450,"CHOCÓ","MEDIO SAN JUAN","CHOCÓ - MEDIO SAN JUAN",17859,2.2599999999999998,1.3898999999999999,1]
[null,27491,"CHOCÓ","NÓVITA","CHOCÓ - NÓVITA",7967,1.05,0.64575000000000005,1]
[null,27495,"CHOCÓ","NUQUÍ","CHOCÓ - NUQUÍ",8958,0.6,0.36899999999999999,1]
[null,27580,"CHOCÓ","RÍO IRÓ","CHOCÓ - RÍO IRÓ",10396,0.76,0.46739999999999998,1]
[null,27600,"CHOCÓ","RÍO QUITO","CHOCÓ - RÍO QUITO",9395,0.7,0.43049999999999999,1]
[null,27615,"CHOCÓ","RIOSUCIO","CHOCÓ - RIOSUCIO",29036,2.92,1.7957999999999998,1]
[null,27660,"CHOCÓ","SAN JOSÉ DEL PALMAR","CHOCÓ - SAN JOSÉ DEL PALMAR",4723,2.09,1.28535,1]
[null,27745,"CHOCÓ","SIPÍ","CHOCÓ - SIPÍ",4273,6.26,3.8498999999999999,1]
[null,27787,"CHOCÓ","TADÓ","CHOCÓ - TADÓ",19169,4.46,2.7429000000000001,1]
[null,27800,"CHOCÓ","UNGUÍA","CHOCÓ - UNGUÍA",15312,2.6,1.599,1]
[null,27810,"CHOCÓ","UNIÓN PANAMERICANA","CHOCÓ - UNIÓN PANAMERICANA",10221,1.91,1.17465,1]
[null,23001,"CÓRDOBA","MONTERÍA","CÓRDOBA - MONTERÍA",465999,294.16000000000003,180.9084,3]
[null,23068,"CÓRDOBA","AYAPEL","CÓRDOBA - AYAPEL",55120,11.31,6.9556500000000003,1]
[null,23079,"CÓRDOBA","BUENAVISTA","CÓRDOBA - BUENAVISTA",22711,5.69,3.4993500000000002,1]
[null,23090,"CÓRDOBA","CANALETE","CÓRDOBA - CANALETE",23520,1.96,1.2054,1]
[null,23162,"CÓRDOBA","CERETÉ","CÓRDOBA - CERETÉ",94355,42.94,26.408099999999997,2]
[null,23168,"CÓRDOBA","CHIMÁ","CÓRDOBA - CHIMÁ",15571,1.96,1.2054,1]
[null,23182,"CÓRDOBA","CHINÚ","CÓRDOBA - CHINÚ",50313,15.04,9.2495999999999992,1]
[null,23189,"CÓRDOBA","CIÉNAGA DE ORO","CÓRDOBA - CIÉNAGA DE ORO",69144,17.309999999999999,10.64565,2]
[null,23300,"CÓRDOBA","COTORRA","CÓRDOBA - COTORRA",15551,1.08,0.66420000000000001,1]
[null,23350,"CÓRDOBA","LA APARTADA","CÓRDOBA - LA APARTADA",16315,4.51,2.7736499999999999,1]
[null,23417,"CÓRDOBA","LORICA","CÓRDOBA - LORICA",121214,30.38,18.683699999999998,2]
[null,23419,"CÓRDOBA","LOS CÓRDOBAS","CÓRDOBA - LOS CÓRDOBAS",26705,2.69,1.65435,1]
[null,23464,"CÓRDOBA","MOMIL","CÓRDOBA - MOMIL",15274,6.38,3.9236999999999997,1]
[null,23466,"CÓRDOBA","MONTELÍBANO","CÓRDOBA - MONTELÍBANO",88674,37.46,23.0379,2]
[null,23500,"CÓRDOBA","MOÑITOS","CÓRDOBA - MOÑITOS",29117,3.3,2.0295000000000001,1]
[null,23555,"CÓRDOBA","PLANETA RICA","CÓRDOBA - PLANETA RICA",69285,28.34,17.429099999999998,2]
[null,23570,"CÓRDOBA","PUEBLO NUEVO",{"$f":"C516&\" - \"&D516","v":"CÓRDOBA - PUEBLO NUEVO"},41684,6.93,4.2619499999999997,{"$f":"IF(H516<$P$3,$O$3,IF(H516<$P$4,$O$4,IF(H516<$P$5,$O$5,$O$6)))","v":1}]
[null,23574,"CÓRDOBA","PUERTO ESCONDIDO","CÓRDOBA - PUERTO ESCONDIDO",32745,2.31,1.42065,1]
[null,23580,"CÓRDOBA","PUERTO LIBERTADOR","CÓRDOBA - PUERTO LIBERTADOR",53990,7.71,4.7416499999999999,1]
[null,23586,"CÓRDOBA","PURÍSIMA DE LA CONCEPCIÓN","CÓRDOBA - PURÍSIMA DE LA CONCEPCIÓN",15189,6.63,4.0774499999999998,1]
[null,23660,"CÓRDOBA","SAHAGÚN","CÓRDOBA - SAHAGÚN",90487,38.53,23.69595,2]
[null,23670,"CÓRDOBA","SAN ANDRÉS DE SOTAVENTO","CÓRDOBA - SAN ANDRÉS DE SOTAVENTO",47282,4.41,2.7121499999999998,1]
[null,23672,"CÓRDOBA","SAN ANTERO","CÓRDOBA - SAN ANTERO",33662,13.5,8.3025000000000002,1]
[null,23675,"CÓRDOBA","SAN BERNARDO DEL VIENTO","CÓRDOBA - SAN BERNARDO DEL VIENTO",36200,2.89,1.77735,1]
[null,23678,"CÓRDOBA","SAN CARLOS","CÓRDOBA - SAN CARLOS",28597,2.33,1.4329499999999999,1]
[null,23682,"CÓRDOBA","SAN JOSÉ DE URÉ","CÓRDOBA - SAN JOSÉ DE URÉ",11742,2.08,1.2792000000000001,1]
[null,23686,"CÓRDOBA","SAN PELAYO","CÓRDOBA - SAN PELAYO",45396,5.42,3.3332999999999999,1]
[null,23807,"CÓRDOBA","TIERRALTA","CÓRDOBA - TIERRALTA",109770,22.53,13.85595,2]
[null,23815,"CÓRDOBA","TUCHÍN","CÓRDOBA - TUCHÍN",41345,4.3099999999999996,2.6506499999999997,1]
[null,23855,"CÓRDOBA","VALENCIA","CÓRDOBA - VALENCIA",46897,8.18,5.0306999999999995,1]
[null,25001,"CUNDINAMARCA","AGUA DE DIOS","CUNDINAMARCA - AGUA DE DIOS",10634,6.25,3.84375,1]
[null,25019,"CUNDINAMARCA","ALBÁN","CUNDINAMARCA - ALBÁN",5957,1.93,1.1869499999999999,1]
[null,25035,"CUNDINAMARCA","ANAPOIMA","CUNDINAMARCA - ANAPOIMA",14126,11.37,6.9925499999999996,1]
[null,25040,"CUNDINAMARCA","ANOLAIMA","CUNDINAMARCA - ANOLAIMA",11894,4.6500000000000004,2.85975,1]
[null,25053,"CUNDINAMARCA","ARBELÁEZ","CUNDINAMARCA - ARBELÁEZ",12449,0.84,0.51659999999999995,1]
[null,25086,"CUNDINAMARCA","BELTRÁN","CUNDINAMARCA - BELTRÁN",2322,0.45,0.27675,1]
[null,25095,"CUNDINAMARCA","BITUIMA","CUNDINAMARCA - BITUIMA",2468,0.45,0.27675,1]
[null,25099,"CUNDINAMARCA","BOJACÁ","CUNDINAMARCA - BOJACÁ",12749,5.03,3.0934500000000003,1]
[null,25120,"CUNDINAMARCA","CABRERA","CUNDINAMARCA - CABRERA",4411,0.69,0.42434999999999995,1]
[null,25123,"CUNDINAMARCA","CACHIPAY","CUNDINAMARCA - CACHIPAY",9740,3.74,2.3001,1]
[null,25126,"CUNDINAMARCA","CAJICÁ","CUNDINAMARCA - CAJICÁ",61549,46.42,28.548300000000001,2]
[null,25148,"CUNDINAMARCA","CAPARRAPÍ","CUNDINAMARCA - CAPARRAPÍ",16748,2.56,1.5744,1]
[null,25151,"CUNDINAMARCA","CÁQUEZA","CUNDINAMARCA - CÁQUEZA",17396,4.97,3.0565499999999997,1]
[null,25154,"CUNDINAMARCA","CARMEN DE CARUPA","CUNDINAMARCA - CARMEN DE CARUPA",9458,0.54,0.33210000000000001,1]
[null,25168,"CUNDINAMARCA","CHAGUANÍ","CUNDINAMARCA - CHAGUANÍ",3960,0.63,0.38745000000000002,1]
[null,25175,"CUNDINAMARCA","CHÍA","CUNDINAMARCA - CHÍA",138822,101.15,62.207250000000002,3]
[null,25178,"CUNDINAMARCA","CHIPAQUE","CUNDINAMARCA - CHIPAQUE",8401,2.3199999999999998,1.4267999999999998,1]
[null,25181,"CUNDINAMARCA","CHOACHÍ","CUNDINAMARCA - CHOACHÍ",10487,2.8,1.722,1]
[null,25183,"CUNDINAMARCA","CHOCONTÁ","CUNDINAMARCA - CHOCONTÁ",27927,5.49,3.37635,1]
[null,25200,"CUNDINAMARCA","COGUA","CUNDINAMARCA - COGUA",24092,9.11,5.6026499999999997,1]
[null,25214,"CUNDINAMARCA","COTA","CUNDINAMARCA - COTA",26980,39.33,24.187949999999997,2]
[null,25224,"CUNDINAMARCA","CUCUNUBÁ","CUNDINAMARCA - CUCUNUBÁ",7623,0.83,0.51044999999999996,1]
[null,25245,"CUNDINAMARCA","EL COLEGIO","CUNDINAMARCA - EL COLEGIO",22247,25.59,15.73785,2]
[null,25258,"CUNDINAMARCA","EL PEÑÓN","CUNDINAMARCA - EL PEÑÓN",4759,0.53,0.32595000000000002,1]
[null,25260,"CUNDINAMARCA","EL ROSAL","CUNDINAMARCA - EL ROSAL",18847,24.38,14.993699999999999,2]
[null,25269,"CUNDINAMARCA","FACATATIVÁ","CUNDINAMARCA - FACATATIVÁ",141762,91.81,56.463149999999999,3]
[null,25279,"CUNDINAMARCA","FÓMEQUE","CUNDINAMARCA - FÓMEQUE",12227,2.83,1.7404500000000001,1]
[null,25281,"CUNDINAMARCA","FOSCA","CUNDINAMARCA - FOSCA",7968,0.77,0.47355000000000003,1]
[null,25286,"CUNDINAMARCA","FUNZA","CUNDINAMARCA - FUNZA",80937,66.87,41.125050000000002,2]
[null,25288,"CUNDINAMARCA","FÚQUENE","CUNDINAMARCA - FÚQUENE",5839,0.61,0.37514999999999998,1]
[null,25290,"CUNDINAMARCA","FUSAGASUGÁ","CUNDINAMARCA - FUSAGASUGÁ",145039,73.489999999999995,45.196349999999995,2]
[null,25293,"CUNDINAMARCA","GACHALÁ","CUNDINAMARCA - GACHALÁ",5663,0.95,0.58424999999999994,1]
[null,25295,"CUNDINAMARCA","GACHANCIPÁ","CUNDINAMARCA - GACHANCIPÁ",16043,8.01,4.9261499999999998,1]
[null,25297,"CUNDINAMARCA","GACHETÁ","CUNDINAMARCA - GACHETÁ",11383,2.14,1.3161,1]
[null,25299,"CUNDINAMARCA","GAMA","CUNDINAMARCA - GAMA",4063,0.36,0.22139999999999999,1]
[null,25307,"CUNDINAMARCA","GIRARDOT","CUNDINAMARCA - GIRARDOT",107324,97.96,60.245399999999997,3]
[null,25312,"CUNDINAMARCA","GRANADA","CUNDINAMARCA - GRANADA",9440,3.27,2.01105,1]
[null,25317,"CUNDINAMARCA","GUACHETÁ","CUNDINAMARCA - GUACHETÁ",11335,1.79,1.1008500000000001,1]
[null,25320,"CUNDINAMARCA","GUADUAS","CUNDINAMARCA - GUADUAS",41142,16.989999999999998,10.448849999999998,2]
[null,25322,"CUNDINAMARCA","GUASCA","CUNDINAMARCA - GUASCA",15727,5.48,3.3702000000000001,1]
[null,25324,"CUNDINAMARCA","GUATAQUÍ","CUNDINAMARCA - GUATAQUÍ",2711,0.74,0.4551,1]
[null,25326,"CUNDINAMARCA","GUATAVITA","CUNDINAMARCA - GUATAVITA",6963,1.79,1.1008500000000001,1]
[null,25328,"CUNDINAMARCA","GUAYABAL DE SÍQUIMA","CUNDINAMARCA - GUAYABAL DE SÍQUIMA",3668,0.89,0.54735,1]
[null,25335,"CUNDINAMARCA","GUAYABETAL","CUNDINAMARCA - GUAYABETAL",5013,5.94,3.6531000000000002,1]
[null,25339,"CUNDINAMARCA","GUTIÉRREZ","CUNDINAMARCA - GUTIÉRREZ",4386,0.56000000000000005,0.34440000000000004,1]
[null,25368,"CUNDINAMARCA","JERUSALÉN","CUNDINAMARCA - JERUSALÉN",2660,0.51,0.31364999999999998,1]
[null,25372,"CUNDINAMARCA","JUNÍN","CUNDINAMARCA - JUNÍN",8720,0.83,0.51044999999999996,1]
[null,25377,"CUNDINAMARCA","LA CALERA","CUNDINAMARCA - LA CALERA",28908,16.14,9.9260999999999999,1]
[null,25386,"CUNDINAMARCA","LA MESA","CUNDINAMARCA - LA MESA",33241,19.91,12.24465,2]
[null,25394,"CUNDINAMARCA","LA PALMA","CUNDINAMARCA - LA PALMA",11096,1.87,1.15005,1]
[null,25398,"CUNDINAMARCA","LA PEÑA",{"$f":"C580&\" - \"&D580","v":"CUNDINAMARCA - LA PEÑA"},7052,0.82,0.50429999999999997,{"$f":"IF(H580<$P$3,$O$3,IF(H580<$P$4,$O$4,IF(H580<$P$5,$O$5,$O$6)))","v":1}]
[null,25402,"CUNDINAMARCA","LA VEGA","CUNDINAMARCA - LA VEGA",14571,9.8000000000000007,6.0270000000000001,1]
[null,25407,"CUNDINAMARCA","LENGUAZAQUE","CUNDINAMARCA - LENGUAZAQUE",10427,1.53,0.94094999999999995,1]
[null,25426,"CUNDINAMARCA","MACHETÁ","CUNDINAMARCA - MACHETÁ",6127,1.41,0.86714999999999998,1]
[null,25430,"CUNDINAMARCA","MADRID","CUNDINAMARCA - MADRID",83612,70.03,43.068449999999999,2]
[null,25436,"CUNDINAMARCA","MANTA","CUNDINAMARCA - MANTA",4786,0.56999999999999995,0.35054999999999997,1]
[null,25438,"CUNDINAMARCA","MEDINA","CUNDINAMARCA - MEDINA",10205,1.69,1.03935,1]
[null,25473,"CUNDINAMARCA","MOSQUERA","CUNDINAMARCA - MOSQUERA",91282,102.28,62.902200000000001,3]
[null,25483,"CUNDINAMARCA","NARIÑO","CUNDINAMARCA - NARIÑO",2266,1.39,0.85484999999999989,1]
[null,25486,"CUNDINAMARCA","NEMOCÓN","CUNDINAMARCA - NEMOCÓN",14356,3.68,2.2631999999999999,1]
[null,25488,"CUNDINAMARCA","NILO","CUNDINAMARCA - NILO",20339,12.53,7.7059499999999996,1]
[null,25489,"CUNDINAMARCA","NIMAIMA","CUNDINAMARCA - NIMAIMA",7213,1.25,0.76875000000000004,1]
[null,25491,"CUNDINAMARCA","NOCAIMA","CUNDINAMARCA - NOCAIMA",8211,2.0299999999999998,1.2484499999999998,1]
[null,25506,"CUNDINAMARCA","VENECIA","CUNDINAMARCA - VENECIA",4093,0.76,0.46739999999999998,1]
[null,25513,"CUNDINAMARCA","PACHO","CUNDINAMARCA - PACHO",27977,6.67,4.1020500000000002,1]
[null,25518,"CUNDINAMARCA","PAIME","CUNDINAMARCA - PAIME",4167,0.51,0.31364999999999998,1]
[null,25524,"CUNDINAMARCA","PANDI","CUNDINAMARCA - PANDI",5729,1.1399999999999999,0.70109999999999995,1]
[null,25530,"CUNDINAMARCA","PARATEBUENO","CUNDINAMARCA - PARATEBUENO",7835,2.94,1.8081,1]
[null,25535,"CUNDINAMARCA","PASCA","CUNDINAMARCA - PASCA",12584,1.84,1.1315999999999999,1]
[null,25572,"CUNDINAMARCA","PUERTO SALGAR","CUNDINAMARCA - PUERTO SALGAR",19996,7.54,4.6371000000000002,1]
[null,25580,"CUNDINAMARCA","PULÍ","CUNDINAMARCA - PULÍ",3038,0.28000000000000003,0.17220000000000002,1]
[null,25592,"CUNDINAMARCA","QUEBRADANEGRA","CUNDINAMARCA - QUEBRADANEGRA",4761,1.42,0.87329999999999997,1]
[null,25594,"CUNDINAMARCA","QUETAME","CUNDINAMARCA - QUETAME",7344,1.22,0.75029999999999997,1]
[null,25596,"CUNDINAMARCA","QUIPILE","CUNDINAMARCA - QUIPILE",8143,0.8,0.49199999999999999,1]
[null,25599,"CUNDINAMARCA","APULO","CUNDINAMARCA - APULO",7812,4.0199999999999996,2.4722999999999997,1]
[null,25612,"CUNDINAMARCA","RICAURTE","CUNDINAMARCA - RICAURTE",9976,15.51,9.5386500000000005,1]
[null,25645,"CUNDINAMARCA","SAN ANTONIO DEL TEQUENDAMA","CUNDINAMARCA - SAN ANTONIO DEL TEQUENDAMA",13341,3.52,2.1648000000000001,1]
[null,25649,"CUNDINAMARCA","SAN BERNARDO","CUNDINAMARCA - SAN BERNARDO",10801,1.62,0.99630000000000007,1]
[null,25653,"CUNDINAMARCA","SAN CAYETANO","CUNDINAMARCA - SAN CAYETANO",5356,0.39,0.23985000000000001,1]
[null,25658,"CUNDINAMARCA","SAN FRANCISCO","CUNDINAMARCA - SAN FRANCISCO",10157,4.45,2.7367500000000002,1]
[null,25662,"CUNDINAMARCA","SAN JUAN DE RIOSECO","CUNDINAMARCA - SAN JUAN DE RIOSECO",9674,3.44,2.1156000000000001,1]
[null,25718,"CUNDINAMARCA","SASAIMA","CUNDINAMARCA - SASAIMA",10868,3.43,2.1094500000000003,1]
[null,25736,"CUNDINAMARCA","SESQUILÉ","CUNDINAMARCA - SESQUILÉ",15943,10.31,6.3406500000000001,1]
[null,25740,"CUNDINAMARCA","SIBATÉ","CUNDINAMARCA - SIBATÉ",41255,21.18,13.025700000000001,2]
[null,25743,"CUNDINAMARCA","SILVANIA","CUNDINAMARCA - SILVANIA",22076,6.87,4.2250500000000004,1]
[null,25745,"CUNDINAMARCA","SIMIJACA","CUNDINAMARCA - SIMIJACA",13967,2.86,1.7588999999999999,1]
[null,25754,"CUNDINAMARCA","SOACHA","CUNDINAMARCA - SOACHA",556268,423.06,260.18189999999998,3]
[null,25758,"CUNDINAMARCA","SOPÓ","CUNDINAMARCA - SOPÓ",29120,16.87,10.37505,2]
[null,25769,"CUNDINAMARCA","SUBACHOQUE","CUNDINAMARCA - SUBACHOQUE",17387,6.86,4.2189000000000005,1]
[null,25772,"CUNDINAMARCA","SUESCA","CUNDINAMARCA - SUESCA",18741,3.63,2.23245,1]
[null,25777,"CUNDINAMARCA","SUPATÁ","CUNDINAMARCA - SUPATÁ",5036,1.0900000000000001,0.67035,1]
[null,25779,"CUNDINAMARCA","SUSA","CUNDINAMARCA - SUSA",13491,0.81,0.49815000000000004,1]
[null,25781,"CUNDINAMARCA","SUTATAUSA","CUNDINAMARCA - SUTATAUSA",5885,1.1399999999999999,0.70109999999999995,1]
[null,25785,"CUNDINAMARCA","TABIO","CUNDINAMARCA - TABIO",29731,8.44,5.1905999999999999,1]
[null,25793,"CUNDINAMARCA","TAUSA","CUNDINAMARCA - TAUSA",9197,0.97,0.59655000000000002,1]
[null,25797,"CUNDINAMARCA","TENA","CUNDINAMARCA - TENA",9507,4.3600000000000003,2.6814,1]
[null,25799,"CUNDINAMARCA","TENJO","CUNDINAMARCA - TENJO",20269,12.75,7.8412499999999996,1]
[null,25805,"CUNDINAMARCA","TIBACUY","CUNDINAMARCA - TIBACUY",4839,0.72,0.44279999999999997,1]
[null,25807,"CUNDINAMARCA","TIBIRITA","CUNDINAMARCA - TIBIRITA",2931,0.4,0.246,1]
[null,25815,"CUNDINAMARCA","TOCAIMA","CUNDINAMARCA - TOCAIMA",18790,9.5399999999999991,5.8670999999999998,1]
[null,25817,"CUNDINAMARCA","TOCANCIPÁ","CUNDINAMARCA - TOCANCIPÁ",35439,29.9,18.388500000000001,2]
[null,25823,"CUNDINAMARCA","TOPAIPÍ","CUNDINAMARCA - TOPAIPÍ",4482,0.26,0.15990000000000001,1]
[null,25839,"CUNDINAMARCA","UBALÁ","CUNDINAMARCA - UBALÁ",10209,1.17,0.71954999999999991,1]
[null,25841,"CUNDINAMARCA","UBAQUE","CUNDINAMARCA - UBAQUE",5887,1.06,0.65190000000000003,1]
[null,25843,"CUNDINAMARCA","VILLA DE SAN DIEGO DE UBATÉ","CUNDINAMARCA - VILLA DE SAN DIEGO DE UBATÉ",39568,20.96,12.8904,2]
[null,25845,"CUNDINAMARCA","UNE","CUNDINAMARCA - UNE",9681,1.75,1.0762499999999999,1]
[null,25851,"CUNDINAMARCA","ÚTICA","CUNDINAMARCA - ÚTICA",5042,1.79,1.1008500000000001,1]
[null,25862,"CUNDINAMARCA","VERGARA","CUNDINAMARCA - VERGARA",7731,0.96,0.59039999999999992,1]
[null,25867,"CUNDINAMARCA","VIANÍ","CUNDINAMARCA - VIANÍ",4239,1,0.61499999999999999,1]
[null,25871,"CUNDINAMARCA","VILLAGÓMEZ","CUNDINAMARCA - VILLAGÓMEZ",2171,0.28000000000000003,0.17220000000000002,1]
[null,25873,"CUNDINAMARCA","VILLAPINZÓN","CUNDINAMARCA - VILLAPINZÓN",21049,4.33,2.6629499999999999,1]
[null,25875,"CUNDINAMARCA","VILLETA","CUNDINAMARCA - VILLETA",25617,18.760000000000002,11.537400000000002,2]
[null,25878,"CUNDINAMARCA","VIOTÁ","CUNDINAMARCA - VIOTÁ",13317,3.77,2.3185500000000001,1]
[null,25885,"CUNDINAMARCA","YACOPÍ","CUNDINAMARCA - YACOPÍ",17160,1.88,1.1561999999999999,1]
[null,25898,"CUNDINAMARCA","ZIPACÓN",{"$f":"C644&\" - \"&D644","v":"CUNDINAMARCA - ZIPACÓN"},5808,1.32,0.81180000000000008,{"$f":"IF(H644<$P$3,$O$3,IF(H644<$P$4,$O$4,IF(H644<$P$5,$O$5,$O$6)))","v":1}]
[null,25899,"CUNDINAMARCA","ZIPAQUIRÁ","CUNDINAMARCA - ZIPAQUIRÁ",130432,75.989999999999995,46.733849999999997,2]
[null,94001,"GUAINÍA","INÍRIDA","GUAINÍA - INÍRIDA",20478,11.87,7.3000499999999997,1]
[null,94343,"GUAINÍA","BARRANCOMINAS","GUAINÍA - BARRANCOMINAS",5025,7.96,4.8953999999999995,1]
[null,94663,"GUAINÍA","MAPIRIPANA  ","GUAINÍA - MAPIRIPANA  ",2730,1.24488,0.76560119999999998,1]
[null,94883,"GUAINÍA","SAN FELIPE  ","GUAINÍA - SAN FELIPE  ",2398,1.093488,0.67249512,1]
[null,94884,"GUAINÍA","PUERTO COLOMBIA  ","GUAINÍA - PUERTO COLOMBIA  ",5132,2.340192,1.4392180800000001,1]
[null,94885,"GUAINÍA","LA GUADALUPE  ","GUAINÍA - LA GUADALUPE  ",429,0.19562399999999999,0.12030875999999999,1]
[null,94886,"GUAINÍA","CACAHUAL  ","GUAINÍA - CACAHUAL  ",2935,1.33836,0.82309140000000003,1]
[null,94887,"GUAINÍA","PANA PANA  ","GUAINÍA - PANA PANA  ",3579,1.6320239999999999,1.0036947599999999,1]
[null,94888,"GUAINÍA","MORICHAL  ","GUAINÍA - MORICHAL  ",1428,0.65116799999999997,0.40046831999999999,1]
[null,95001,"GUAVIARE","SAN JOSÉ DEL GUAVIARE","GUAVIARE - SAN JOSÉ DEL GUAVIARE",68878,35.950000000000003,22.109250000000003,2]
[null,95025,"GUAVIARE","EL RETORNO","GUAVIARE - EL RETORNO",24562,1.97,1.2115499999999999,1]
[null,95200,"GUAVIARE","MIRAFLORES","GUAVIARE - MIRAFLORES",15803,1.53,0.94094999999999995,1]
[null,95015,"GUAVIARE","CALAMAR","GUAVIARE - CALAMAR",8251,1.61,0.99015000000000009,1]
[null,41001,"HUILA","NEIVA","HUILA - NEIVA",348964,200.6,123.369,3]
[null,41006,"HUILA","ACEVEDO","HUILA - ACEVEDO",35877,4.66,2.8658999999999999,1]
[null,41013,"HUILA","AGRADO","HUILA - AGRADO",9275,1.23,0.75644999999999996,1]
[null,41016,"HUILA","AIPE","HUILA - AIPE",29177,6.35,3.9052499999999997,1]
[null,41020,"HUILA","ALGECIRAS","HUILA - ALGECIRAS",24708,6.87,4.2250500000000004,1]
[null,41026,"HUILA","ALTAMIRA","HUILA - ALTAMIRA",4626,2.2200000000000002,1.3653000000000002,1]
[null,41078,"HUILA","BARAYA","HUILA - BARAYA",9751,2.08,1.2792000000000001,1]
[null,41132,"HUILA","CAMPOALEGRE","HUILA - CAMPOALEGRE",34923,14.63,8.9974500000000006,1]
[null,41206,"HUILA","COLOMBIA","HUILA - COLOMBIA",12890,1.39,0.85484999999999989,1]
[null,41244,"HUILA","ELÍAS","HUILA - ELÍAS",4206,1.1499999999999999,0.70724999999999993,1]
[null,41298,"HUILA","GARZÓN","HUILA - GARZÓN",96296,28.11,17.287649999999999,2]
[null,41306,"HUILA","GIGANTE","HUILA - GIGANTE",35498,6.96,4.2804000000000002,1]
[null,41319,"HUILA","GUADALUPE","HUILA - GUADALUPE",22867,2.12,1.3038000000000001,1]
[null,41349,"HUILA","HOBO","HUILA - HOBO",7043,3.7,2.2755000000000001,1]
[null,41357,"HUILA","ÍQUIRA","HUILA - ÍQUIRA",13612,1.68,1.0331999999999999,1]
[null,41359,"HUILA","ISNOS","HUILA - ISNOS",28530,3.27,2.01105,1]
[null,41378,"HUILA","LA ARGENTINA","HUILA - LA ARGENTINA",15059,1.52,0.93479999999999996,1]
[null,41396,"HUILA","LA PLATA","HUILA - LA PLATA",67220,14.69,9.0343499999999999,1]
[null,41483,"HUILA","NÁTAGA","HUILA - NÁTAGA",6543,1.24,0.76259999999999994,1]
[null,41503,"HUILA","OPORAPA","HUILA - OPORAPA",14812,0.97,0.59655000000000002,1]
[null,41518,"HUILA","PAICOL","HUILA - PAICOL",5734,1.31,0.80564999999999998,1]
[null,41524,"HUILA","PALERMO","HUILA - PALERMO",34987,11.88,7.3062000000000005,1]
[null,41530,"HUILA","PALESTINA","HUILA - PALESTINA",12075,1.05,0.64575000000000005,1]
[null,41548,"HUILA","PITAL","HUILA - PITAL",14030,1.84,1.1315999999999999,1]
[null,41551,"HUILA","PITALITO","HUILA - PITALITO",135711,52.19,32.096849999999996,2]
[null,41615,"HUILA","RIVERA","HUILA - RIVERA",19566,17.62,10.8363,2]
[null,41660,"HUILA","SALADOBLANCO","HUILA - SALADOBLANCO",11930,1.1399999999999999,0.70109999999999995,1]
[null,41668,"HUILA","SAN AGUSTÍN","HUILA - SAN AGUSTÍN",34120,3.32,2.0417999999999998,1]
[null,41676,"HUILA","SANTA MARÍA","HUILA - SANTA MARÍA",11744,1.64,1.0085999999999999,1]
[null,41770,"HUILA","SUAZA","HUILA - SUAZA",21119,4.1900000000000004,2.5768500000000003,1]
[null,41791,"HUILA","TARQUI","HUILA - TARQUI",18271,3.01,1.8511499999999999,1]
[null,41797,"HUILA","TESALIA","HUILA - TESALIA",9365,3.87,2.3800500000000002,1]
[null,41799,"HUILA","TELLO","HUILA - TELLO",14536,4.53,2.7859500000000001,1]
[null,41801,"HUILA","TERUEL","HUILA - TERUEL",8916,1.67,1.02705,1]
[null,41807,"HUILA","TIMANÁ","HUILA - TIMANÁ",20463,5.45,3.35175,1]
[null,41872,"HUILA","VILLAVIEJA","HUILA - VILLAVIEJA",7309,1.93,1.1869499999999999,1]
[null,41885,"HUILA","YAGUARÁ","HUILA - YAGUARÁ",9410,0.69,0.42434999999999995,1]
[null,44001,"LA GUAJIRA","RIOHACHA","LA GUAJIRA - RIOHACHA",295984,129.02000000000001,79.347300000000004,3]
[null,44035,"LA GUAJIRA","ALBANIA","LA GUAJIRA - ALBANIA",28474,4.04,2.4845999999999999,1]
[null,44078,"LA GUAJIRA","BARRANCAS","LA GUAJIRA - BARRANCAS",37554,3.05,1.8757499999999998,1]
[null,44090,"LA GUAJIRA","DIBULLA","LA GUAJIRA - DIBULLA",37854,11.64,7.1585999999999999,1]
[null,44098,"LA GUAJIRA","DISTRACCIÓN","LA GUAJIRA - DISTRACCIÓN",17112,7.58,4.6616999999999997,1]
[null,44110,"LA GUAJIRA","EL MOLINO","LA GUAJIRA - EL MOLINO",9121,4.4400000000000004,2.7306000000000004,1]
[null,44279,"LA GUAJIRA","FONSECA","LA GUAJIRA - FONSECA",35205,30.28,18.622199999999999,2]
[null,44378,"LA GUAJIRA","HATONUEVO","LA GUAJIRA - HATONUEVO",28671,8.0399999999999991,4.9445999999999994,1]
[null,44420,"LA GUAJIRA","LA JAGUA DEL PILAR","LA GUAJIRA - LA JAGUA DEL PILAR",3341,0.94,0.57809999999999995,1]
[null,44430,"LA GUAJIRA","MAICAO","LA GUAJIRA - MAICAO",166603,95.32,58.621799999999993,3]
[null,44560,"LA GUAJIRA","MANAURE","LA GUAJIRA - MANAURE",120417,9.77,6.0085499999999996,1]
[null,44650,"LA GUAJIRA","SAN JUAN DEL CESAR","LA GUAJIRA - SAN JUAN DEL CESAR",39472,23.39,14.38485,2]
[null,44847,"LA GUAJIRA","URIBIA",{"$f":"C708&\" - \"&D708","v":"LA GUAJIRA - URIBIA"},198890,9.5500000000000007,5.8732500000000005,{"$f":"IF(H708<$P$3,$O$3,IF(H708<$P$4,$O$4,IF(H708<$P$5,$O$5,$O$6)))","v":1}]
[null,44855,"LA GUAJIRA","URUMITA","LA GUAJIRA - URUMITA",19629,5.13,3.1549499999999999,1]
[null,44874,"LA GUAJIRA","VILLANUEVA","LA GUAJIRA - VILLANUEVA",28736,16.420000000000002,10.0983,2]
[null,47001,"MAGDALENA","SANTA MARTA","MAGDALENA - SANTA MARTA",515717,507.86,312.33390000000003,3]
[null,47030,"MAGDALENA","ALGARROBO","MAGDALENA - ALGARROBO",12940,0.85,0.52274999999999994,1]
[null,47053,"MAGDALENA","ARACATACA","MAGDALENA - ARACATACA",41371,16.78,10.319700000000001,2]
[null,47058,"MAGDALENA","ARIGUANÍ","MAGDALENA - ARIGUANÍ",32637,11.22,6.9003000000000005,1]
[null,47161,"MAGDALENA","CERRO DE SAN ANTONIO","MAGDALENA - CERRO DE SAN ANTONIO",7692,0.94,0.57809999999999995,1]
[null,47170,"MAGDALENA","CHIBOLO","MAGDALENA - CHIBOLO",15757,6.23,3.8314500000000002,1]
[null,47189,"MAGDALENA","CIÉNAGA","MAGDALENA - CIÉNAGA",105510,79.75,49.046250000000001,2]
[null,47205,"MAGDALENA","CONCORDIA","MAGDALENA - CONCORDIA",9231,2.5099999999999998,1.5436499999999997,1]
[null,47245,"MAGDALENA","EL BANCO","MAGDALENA - EL BANCO",56097,28.67,17.63205,2]
[null,47258,"MAGDALENA","EL PIÑÓN","MAGDALENA - EL PIÑÓN",16713,3.13,1.9249499999999999,1]
[null,47268,"MAGDALENA","EL RETÉN","MAGDALENA - EL RETÉN",22042,8.44,5.1905999999999999,1]
[null,47288,"MAGDALENA","FUNDACIÓN","MAGDALENA - FUNDACIÓN",57595,34.68,21.328199999999999,2]
[null,47318,"MAGDALENA","GUAMAL","MAGDALENA - GUAMAL",28277,0.44,0.27060000000000001,1]
[null,47460,"MAGDALENA","NUEVA GRANADA","MAGDALENA - NUEVA GRANADA",21612,3.14,1.9311,1]
[null,47541,"MAGDALENA","PEDRAZA","MAGDALENA - PEDRAZA",8122,0.21,0.12914999999999999,1]
[null,47545,"MAGDALENA","PIJIÑO DEL CARMEN","MAGDALENA - PIJIÑO DEL CARMEN",16636,4.0599999999999996,2.4968999999999997,1]
[null,47551,"MAGDALENA","PIVIJAY","MAGDALENA - PIVIJAY",33225,7.75,4.7662500000000003,1]
[null,47555,"MAGDALENA","PLATO","MAGDALENA - PLATO",61856,21.5,13.2225,2]
[null,47570,"MAGDALENA","PUEBLOVIEJO","MAGDALENA - PUEBLOVIEJO",33030,5.61,3.4501500000000003,1]
[null,47605,"MAGDALENA","REMOLINO","MAGDALENA - REMOLINO",7933,3.79,2.3308499999999999,1]
[null,47660,"MAGDALENA","SABANAS DE SAN ÁNGEL","MAGDALENA - SABANAS DE SAN ÁNGEL",17832,11.37,6.9925499999999996,1]
[null,47675,"MAGDALENA","SALAMINA","MAGDALENA - SALAMINA",6665,5.69,3.4993500000000002,1]
[null,47692,"MAGDALENA","SAN SEBASTIÁN DE BUENAVISTA","MAGDALENA - SAN SEBASTIÁN DE BUENAVISTA",17599,3.46,2.1278999999999999,1]
[null,47703,"MAGDALENA","SAN ZENÓN","MAGDALENA - SAN ZENÓN",9203,1.04,0.63960000000000006,1]
[null,47707,"MAGDALENA","SANTA ANA","MAGDALENA - SANTA ANA",27258,7.54,4.6371000000000002,1]
[null,47720,"MAGDALENA","SANTA BÁRBARA DE PINTO","MAGDALENA - SANTA BÁRBARA DE PINTO",13286,4.46,2.7429000000000001,1]
[null,47745,"MAGDALENA","SITIONUEVO","MAGDALENA - SITIONUEVO",33130,9.9,6.0884999999999998,1]
[null,47798,"MAGDALENA","TENERIFE","MAGDALENA - TENERIFE",12215,3.4,2.0909999999999997,1]
[null,47960,"MAGDALENA","ZAPAYÁN","MAGDALENA - ZAPAYÁN",8935,0.33,0.20295000000000002,1]
[null,47980,"MAGDALENA","ZONA BANANERA","MAGDALENA - ZONA BANANERA",62312,32.159999999999997,19.778399999999998,2]
[null,50001,"META","VILLAVICENCIO","META - VILLAVICENCIO",527673,382.28,235.10219999999998,3]
[null,50006,"META","ACACÍAS","META - ACACÍAS",75252,48.83,30.030449999999998,2]
[null,50110,"META","BARRANCA DE UPÍA","META - BARRANCA DE UPÍA",4267,2.96,1.8204,1]
[null,50124,"META","CABUYARO","META - CABUYARO",4145,2.5299999999999998,1.5559499999999999,1]
[null,50150,"META","CASTILLA LA NUEVA","META - CASTILLA LA NUEVA",10803,11.24,6.9126000000000003,1]
[null,50223,"META","CUBARRAL","META - CUBARRAL",6261,2.79,1.7158500000000001,1]
[null,50226,"META","CUMARAL","META - CUMARAL",18501,11.19,6.88185,1]
[null,50245,"META","EL CALVARIO","META - EL CALVARIO",2220,0.27,0.16605,1]
[null,50251,"META","EL CASTILLO","META - EL CASTILLO",6127,2.92,1.7957999999999998,1]
[null,50270,"META","EL DORADO","META - EL DORADO",3457,1.2,0.73799999999999999,1]
[null,50287,"META","FUENTE DE ORO","META - FUENTE DE ORO",14139,5.98,3.6777000000000002,1]
[null,50313,"META","GRANADA","META - GRANADA",67192,42.18,25.9407,2]
[null,50318,"META","GUAMAL","META - GUAMAL",9510,6.99,4.2988499999999998,1]
[null,50325,"META","MAPIRIPÁN","META - MAPIRIPÁN",18985,1.1499999999999999,0.70724999999999993,1]
[null,50330,"META","MESETAS","META - MESETAS",11523,3.23,1.98645,1]
[null,50350,"META","LA MACARENA","META - LA MACARENA",36781,2.95,1.8142500000000001,1]
[null,50370,"META","URIBE","META - URIBE",17730,1.18,0.7256999999999999,1]
[null,50400,"META","LEJANÍAS","META - LEJANÍAS",9273,2.97,1.8265500000000001,1]
[null,50450,"META","PUERTO CONCORDIA","META - PUERTO CONCORDIA",23131,2.36,1.4513999999999998,1]
[null,50568,"META","PUERTO GAITÁN","META - PUERTO GAITÁN",19007,22.83,14.040449999999998,2]
[null,50573,"META","PUERTO LÓPEZ","META - PUERTO LÓPEZ",35097,14.53,8.9359500000000001,1]
[null,50577,"META","PUERTO LLERAS","META - PUERTO LLERAS",9372,2.68,1.6482000000000001,1]
[null,50590,"META","PUERTO RICO","META - PUERTO RICO",18943,4.5999999999999996,2.8289999999999997,1]
[null,50606,"META","RESTREPO","META - RESTREPO",10698,9.77,6.0085499999999996,1]
[null,50680,"META","SAN CARLOS DE GUAROA","META - SAN CARLOS DE GUAROA",11070,3.61,2.2201499999999998,1]
[null,50683,"META","SAN JUAN DE ARAMA","META - SAN JUAN DE ARAMA",8692,2.29,1.40835,1]
[null,50686,"META","SAN JUANITO","META - SAN JUANITO",2270,0.69,0.42434999999999995,1]
[null,50689,"META","SAN MARTÍN","META - SAN MARTÍN",25902,10.53,6.4759499999999992,1]
[null,50711,"META","VISTAHERMOSA","META - VISTAHERMOSA",27235,4.95,3.0442499999999999,1]
[null,52001,"NARIÑO","PASTO","NARIÑO - PASTO",460454,346.14,212.87609999999998,3]
[null,52019,"NARIÑO","ALBÁN","NARIÑO - ALBÁN",23279,2.27,1.39605,1]
[null,52022,"NARIÑO","ALDANA",{"$f":"C772&\" - \"&D772","v":"NARIÑO - ALDANA"},5765,1.75,1.0762499999999999,{"$f":"IF(H772<$P$3,$O$3,IF(H772<$P$4,$O$4,IF(H772<$P$5,$O$5,$O$6)))","v":1}]
[null,52036,"NARIÑO","ANCUYA","NARIÑO - ANCUYA",6411,1.47,0.90405000000000002,1]
[null,52051,"NARIÑO","ARBOLEDA","NARIÑO - ARBOLEDA",7580,1.03,0.63344999999999996,1]
[null,52079,"NARIÑO","BARBACOAS","NARIÑO - BARBACOAS",41306,1.22,0.75029999999999997,1]
[null,52083,"NARIÑO","BELÉN","NARIÑO - BELÉN",7894,7.73,4.7539500000000006,1]
[null,52110,"NARIÑO","BUESACO","NARIÑO - BUESACO",26229,4.9800000000000004,3.0627000000000004,1]
[null,52203,"NARIÑO","COLÓN","NARIÑO - COLÓN",10269,1.35,0.83025000000000004,1]
[null,52207,"NARIÑO","CONSACÁ","NARIÑO - CONSACÁ",8996,1.37,0.84255000000000002,1]
[null,52210,"NARIÑO","CONTADERO","NARIÑO - CONTADERO",7051,0.82,0.50429999999999997,1]
[null,52215,"NARIÑO","CÓRDOBA","NARIÑO - CÓRDOBA",14113,2.04,1.2545999999999999,1]
[null,52224,"NARIÑO","CUASPUD CARLOSAMA","NARIÑO - CUASPUD CARLOSAMA",8775,2.7,1.6605000000000001,1]
[null,52227,"NARIÑO","CUMBAL","NARIÑO - CUMBAL",40492,3.72,2.2878000000000003,1]
[null,52233,"NARIÑO","CUMBITARA","NARIÑO - CUMBITARA",17071,0.88,0.54120000000000001,1]
[null,52240,"NARIÑO","CHACHAGÜÍ","NARIÑO - CHACHAGÜÍ",14139,5.28,3.2472000000000003,1]
[null,52250,"NARIÑO","EL CHARCO","NARIÑO - EL CHARCO",42525,0.94,0.57809999999999995,1]
[null,52254,"NARIÑO","EL PEÑOL","NARIÑO - EL PEÑOL",6355,0.88,0.54120000000000001,1]
[null,52256,"NARIÑO","EL ROSARIO","NARIÑO - EL ROSARIO",9670,0.2,0.123,1]
[null,52258,"NARIÑO","EL TABLÓN DE GÓMEZ","NARIÑO - EL TABLÓN DE GÓMEZ",12256,1.59,0.97785,1]
[null,52260,"NARIÑO","EL TAMBO","NARIÑO - EL TAMBO",11531,3.71,2.28165,1]
[null,52287,"NARIÑO","FUNES","NARIÑO - FUNES",6291,1.05,0.64575000000000005,1]
[null,52317,"NARIÑO","GUACHUCAL","NARIÑO - GUACHUCAL",15123,2.5299999999999998,1.5559499999999999,1]
[null,52320,"NARIÑO","GUAITARILLA","NARIÑO - GUAITARILLA",11330,2.52,1.5498000000000001,1]
[null,52323,"NARIÑO","GUALMATÁN","NARIÑO - GUALMATÁN",5785,0.5,0.3075,1]
[null,52352,"NARIÑO","ILES","NARIÑO - ILES",9038,1.05,0.64575000000000005,1]
[null,52354,"NARIÑO","IMUÉS","NARIÑO - IMUÉS",5776,2.0099999999999998,1.2361499999999999,1]
[null,52356,"NARIÑO","IPIALES","NARIÑO - IPIALES",151533,76.150000000000006,46.832250000000002,2]
[null,52378,"NARIÑO","LA CRUZ","NARIÑO - LA CRUZ",18305,4.9000000000000004,3.0135000000000001,1]
[null,52381,"NARIÑO","LA FLORIDA","NARIÑO - LA FLORIDA",9242,1.38,0.8486999999999999,1]
[null,52385,"NARIÑO","LA LLANADA","NARIÑO - LA LLANADA",5476,0.88,0.54120000000000001,1]
[null,52390,"NARIÑO","LA TOLA","NARIÑO - LA TOLA",14828,3.63,2.23245,1]
[null,52399,"NARIÑO","LA UNIÓN","NARIÑO - LA UNIÓN",25270,3.23,1.98645,1]
[null,52405,"NARIÑO","LEIVA","NARIÑO - LEIVA",14674,1.03,0.63344999999999996,1]
[null,52411,"NARIÑO","LINARES","NARIÑO - LINARES",9358,1.26,0.77490000000000003,1]
[null,52418,"NARIÑO","LOS ANDES","NARIÑO - LOS ANDES",20865,2.62,1.6113,1]
[null,52427,"NARIÑO","MAGÜÍ","NARIÑO - MAGÜÍ",25373,9.07,5.5780500000000002,1]
[null,52435,"NARIÑO","MALLAMA","NARIÑO - MALLAMA",7189,1.55,0.95325000000000004,1]
[null,52473,"NARIÑO","MOSQUERA","NARIÑO - MOSQUERA",18304,10.56,6.4944000000000006,1]
[null,52480,"NARIÑO","NARIÑO","NARIÑO - NARIÑO",5145,1.25,0.76875000000000004,1]
[null,52490,"NARIÑO","OLAYA HERRERA","NARIÑO - OLAYA HERRERA",32759,9.3800000000000008,5.7687000000000008,1]
[null,52506,"NARIÑO","OSPINA","NARIÑO - OSPINA",8861,0.89,0.54735,1]
[null,52520,"NARIÑO","FRANCISCO PIZARRO","NARIÑO - FRANCISCO PIZARRO",16960,2.0299999999999998,1.2484499999999998,1]
[null,52540,"NARIÑO","POLICARPA","NARIÑO - POLICARPA",18104,0.86,0.52890000000000004,1]
[null,52560,"NARIÑO","POTOSÍ","NARIÑO - POTOSÍ",11715,1.85,1.13775,1]
[null,52565,"NARIÑO","PROVIDENCIA","NARIÑO - PROVIDENCIA",13854,0.62,0.38129999999999997,1]
[null,52573,"NARIÑO","PUERRES","NARIÑO - PUERRES",8113,2.02,1.2423,1]
[null,52585,"NARIÑO","PUPIALES","NARIÑO - PUPIALES",19675,5.91,3.6346500000000002,1]
[null,52612,"NARIÑO","RICAURTE","NARIÑO - RICAURTE",20362,2.83,1.7404500000000001,1]
[null,52621,"NARIÑO","ROBERTO PAYÁN","NARIÑO - ROBERTO PAYÁN",25433,0.76,0.46739999999999998,1]
[null,52678,"NARIÑO","SAMANIEGO","NARIÑO - SAMANIEGO",49178,6.79,4.1758499999999996,1]
[null,52683,"NARIÑO","SANDONÁ","NARIÑO - SANDONÁ",25759,6.21,3.81915,1]
[null,52685,"NARIÑO","SAN BERNARDO","NARIÑO - SAN BERNARDO",21492,1.54,0.94710000000000005,1]
[null,52687,"NARIÑO","SAN LORENZO","NARIÑO - SAN LORENZO",20403,1.82,1.1193,1]
[null,52693,"NARIÑO","SAN PABLO","NARIÑO - SAN PABLO",17109,3.65,2.2447499999999998,1]
[null,52694,"NARIÑO","SAN PEDRO DE CARTAGO","NARIÑO - SAN PEDRO DE CARTAGO",7689,0.31,0.19064999999999999,1]
[null,52696,"NARIÑO","SANTA BÁRBARA","NARIÑO - SANTA BÁRBARA",14486,1.71,1.05165,1]
[null,52699,"NARIÑO","SANTACRUZ","NARIÑO - SANTACRUZ",31856,0.87,0.53505000000000003,1]
[null,52720,"NARIÑO","SAPUYES","NARIÑO - SAPUYES",5899,0.91,0.55964999999999998,1]
[null,52786,"NARIÑO","TAMINANGO","NARIÑO - TAMINANGO",21985,5.08,3.1242000000000001,1]
[null,52788,"NARIÑO","TANGUA","NARIÑO - TANGUA",9134,1.47,0.90405000000000002,1]
[null,52835,"NARIÑO","SAN ANDRÉS DE TUMACO","NARIÑO - SAN ANDRÉS DE TUMACO",217079,78.33,48.17295,2]
[null,52838,"NARIÑO","TÚQUERRES","NARIÑO - TÚQUERRES",40159,16.21,9.9691500000000008,1]
[null,52885,"NARIÑO","YACUANQUER","NARIÑO - YACUANQUER",11343,2.2400000000000002,1.3776000000000002,1]
[null,54001,"NORTE DE SANTANDER","CÚCUTA","NORTE DE SANTANDER - CÚCUTA",674831,645.78,397.15469999999999,3]
[null,54003,"NORTE DE SANTANDER","ÁBREGO","NORTE DE SANTANDER - ÁBREGO",39443,7.83,4.8154500000000002,1]
[null,54051,"NORTE DE SANTANDER","ARBOLEDAS",{"$f":"C836&\" - \"&D836","v":"NORTE DE SANTANDER - ARBOLEDAS"},8928,1.44,0.88559999999999994,{"$f":"IF(H836<$P$3,$O$3,IF(H836<$P$4,$O$4,IF(H836<$P$5,$O$5,$O$6)))","v":1}]
[null,54099,"NORTE DE SANTANDER","BOCHALEMA","NORTE DE SANTANDER - BOCHALEMA",7152,2.84,1.7465999999999999,1]
[null,54109,"NORTE DE SANTANDER","BUCARASICA","NORTE DE SANTANDER - BUCARASICA",4568,0.38,0.23369999999999999,1]
[null,54125,"NORTE DE SANTANDER","CÁCOTA","NORTE DE SANTANDER - CÁCOTA",1709,0.56999999999999995,0.35054999999999997,1]
[null,54128,"NORTE DE SANTANDER","CÁCHIRA","NORTE DE SANTANDER - CÁCHIRA",11130,1.17,0.71954999999999991,1]
[null,54172,"NORTE DE SANTANDER","CHINÁCOTA","NORTE DE SANTANDER - CHINÁCOTA",17009,7.61,4.6801500000000003,1]
[null,54174,"NORTE DE SANTANDER","CHITAGÁ","NORTE DE SANTANDER - CHITAGÁ",10445,2.69,1.65435,1]
[null,54206,"NORTE DE SANTANDER","CONVENCIÓN","NORTE DE SANTANDER - CONVENCIÓN",12501,1.57,0.96555000000000002,1]
[null,54223,"NORTE DE SANTANDER","CUCUTILLA","NORTE DE SANTANDER - CUCUTILLA",7429,1.01,0.62114999999999998,1]
[null,54239,"NORTE DE SANTANDER","DURANIA","NORTE DE SANTANDER - DURANIA",3656,1.23,0.75644999999999996,1]
[null,54245,"NORTE DE SANTANDER","EL CARMEN","NORTE DE SANTANDER - EL CARMEN",13153,2.11,1.29765,1]
[null,54250,"NORTE DE SANTANDER","EL TARRA","NORTE DE SANTANDER - EL TARRA",11058,3.34,2.0541,1]
[null,54261,"NORTE DE SANTANDER","EL ZULIA","NORTE DE SANTANDER - EL ZULIA",23921,13.42,8.2532999999999994,1]
[null,54313,"NORTE DE SANTANDER","GRAMALOTE","NORTE DE SANTANDER - GRAMALOTE",5301,0.94,0.57809999999999995,1]
[null,54344,"NORTE DE SANTANDER","HACARÍ","NORTE DE SANTANDER - HACARÍ",10932,1.1599999999999999,0.71339999999999992,1]
[null,54347,"NORTE DE SANTANDER","HERRÁN","NORTE DE SANTANDER - HERRÁN",3874,0.35,0.21525,1]
[null,54377,"NORTE DE SANTANDER","LABATECA","NORTE DE SANTANDER - LABATECA",5911,0.88,0.54120000000000001,1]
[null,54385,"NORTE DE SANTANDER","LA ESPERANZA","NORTE DE SANTANDER - LA ESPERANZA",12486,2.23,1.3714500000000001,1]
[null,54398,"NORTE DE SANTANDER","LA PLAYA","NORTE DE SANTANDER - LA PLAYA",8566,0.85,0.52274999999999994,1]
[null,54405,"NORTE DE SANTANDER","LOS PATIOS","NORTE DE SANTANDER - LOS PATIOS",80235,76.44,47.010599999999997,2]
[null,54418,"NORTE DE SANTANDER","LOURDES","NORTE DE SANTANDER - LOURDES",3347,1.02,0.62729999999999997,1]
[null,54480,"NORTE DE SANTANDER","MUTISCUA","NORTE DE SANTANDER - MUTISCUA",3704,1.1599999999999999,0.71339999999999992,1]
[null,54498,"NORTE DE SANTANDER","OCAÑA","NORTE DE SANTANDER - OCAÑA",101158,66.709999999999994,41.026649999999997,2]
[null,54518,"NORTE DE SANTANDER","PAMPLONA","NORTE DE SANTANDER - PAMPLONA",58975,12.3,7.5645000000000007,1]
[null,54520,"NORTE DE SANTANDER","PAMPLONITA","NORTE DE SANTANDER - PAMPLONITA",4984,1.01,0.62114999999999998,1]
[null,54553,"NORTE DE SANTANDER","PUERTO SANTANDER","NORTE DE SANTANDER - PUERTO SANTANDER",10926,5.13,3.1549499999999999,1]
[null,54599,"NORTE DE SANTANDER","RAGONVALIA","NORTE DE SANTANDER - RAGONVALIA",6912,1.1100000000000001,0.68265000000000009,1]
[null,54660,"NORTE DE SANTANDER","SALAZAR","NORTE DE SANTANDER - SALAZAR",8834,2.29,1.40835,1]
[null,54670,"NORTE DE SANTANDER","SAN CALIXTO","NORTE DE SANTANDER - SAN CALIXTO",14011,0.49,0.30135000000000001,1]
[null,54673,"NORTE DE SANTANDER","SAN CAYETANO","NORTE DE SANTANDER - SAN CAYETANO",5866,3.42,2.1032999999999999,1]
[null,54680,"NORTE DE SANTANDER","SANTIAGO","NORTE DE SANTANDER - SANTIAGO",2887,0.87,0.53505000000000003,1]
[null,54720,"NORTE DE SANTANDER","SARDINATA","NORTE DE SANTANDER - SARDINATA",22583,7.61,4.6801500000000003,1]
[null,54743,"NORTE DE SANTANDER","SILOS","NORTE DE SANTANDER - SILOS",4124,1.76,1.0824,1]
[null,54800,"NORTE DE SANTANDER","TEORAMA","NORTE DE SANTANDER - TEORAMA",23381,3.26,2.0048999999999997,1]
[null,54810,"NORTE DE SANTANDER","TIBÚ","NORTE DE SANTANDER - TIBÚ",37286,20.71,12.736650000000001,2]
[null,54820,"NORTE DE SANTANDER","TOLEDO","NORTE DE SANTANDER - TOLEDO",17288,3.5,2.1524999999999999,1]
[null,54871,"NORTE DE SANTANDER","VILLA CARO","NORTE DE SANTANDER - VILLA CARO",5238,0.6,0.36899999999999999,1]
[null,54874,"NORTE DE SANTANDER","VILLA DEL ROSARIO","NORTE DE SANTANDER - VILLA DEL ROSARIO",96953,67.67,41.617049999999999,2]
[null,86001,"PUTUMAYO","MOCOA","PUTUMAYO - MOCOA",45589,28.05,17.25075,2]
[null,86219,"PUTUMAYO","COLÓN","PUTUMAYO - COLÓN",5701,0.47,0.28904999999999997,1]
[null,86320,"PUTUMAYO","ORITO","PUTUMAYO - ORITO",57774,19.010000000000002,11.69115,2]
[null,86568,"PUTUMAYO","PUERTO ASÍS","PUTUMAYO - PUERTO ASÍS",63067,40.549999999999997,24.938249999999996,2]
[null,86569,"PUTUMAYO","PUERTO CAICEDO","PUTUMAYO - PUERTO CAICEDO",14784,2.1,1.2915000000000001,1]
[null,86571,"PUTUMAYO","PUERTO GUZMÁN","PUTUMAYO - PUERTO GUZMÁN",24355,0.55000000000000004,0.33825,1]
[null,86573,"PUTUMAYO","PUERTO LEGUÍZAMO","PUTUMAYO - PUERTO LEGUÍZAMO",15371,6.4,3.9359999999999999,1]
[null,86749,"PUTUMAYO","SIBUNDOY","PUTUMAYO - SIBUNDOY",14483,3.57,2.1955499999999999,1]
[null,86755,"PUTUMAYO","SAN FRANCISCO","PUTUMAYO - SAN FRANCISCO",7227,7,4.3049999999999997,1]
[null,86757,"PUTUMAYO","SAN MIGUEL","PUTUMAYO - SAN MIGUEL",28982,9.8699999999999992,6.0700499999999993,1]
[null,86760,"PUTUMAYO","SANTIAGO","PUTUMAYO - SANTIAGO",10890,4.43,2.7244499999999996,1]
[null,86865,"PUTUMAYO","VALLE DEL GUAMUEZ","PUTUMAYO - VALLE DEL GUAMUEZ",54237,17.04,10.4796,2]
[null,86885,"PUTUMAYO","VILLAGARZÓN","PUTUMAYO - VILLAGARZÓN",21507,10.59,6.5128500000000003,1]
[null,63001,"QUINDÍO","ARMENIA","QUINDÍO - ARMENIA",302723,220.23,135.44145,3]
[null,63111,"QUINDÍO","BUENAVISTA","QUINDÍO - BUENAVISTA",2730,0.96,0.59039999999999992,1]
[null,63130,"QUINDÍO","CALARCÁ","QUINDÍO - CALARCÁ",79174,38.94,23.948099999999997,2]
[null,63190,"QUINDÍO","CIRCASIA","QUINDÍO - CIRCASIA",30914,15.07,9.2680500000000006,1]
[null,63212,"QUINDÍO","CÓRDOBA","QUINDÍO - CÓRDOBA",5249,1.69,1.03935,1]
[null,63272,"QUINDÍO","FILANDIA","QUINDÍO - FILANDIA",13628,4.0599999999999996,2.4968999999999997,1]
[null,63302,"QUINDÍO","GÉNOVA","QUINDÍO - GÉNOVA",7351,2.94,1.8081,1]
[null,63401,"QUINDÍO","LA TEBAIDA","QUINDÍO - LA TEBAIDA",46323,22.92,14.095800000000001,2]
[null,63470,"QUINDÍO","MONTENEGRO","QUINDÍO - MONTENEGRO",41857,23.34,14.354099999999999,2]
[null,63548,"QUINDÍO","PIJAO","QUINDÍO - PIJAO",5940,2.04,1.2545999999999999,1]
[null,63594,"QUINDÍO","QUIMBAYA","QUINDÍO - QUIMBAYA",35276,15.75,9.6862499999999994,1]
[null,63690,"QUINDÍO","SALENTO","QUINDÍO - SALENTO",7103,5.49,3.37635,1]
[null,66001,"RISARALDA","PEREIRA","RISARALDA - PEREIRA",478892,471.63,290.05244999999996,3]
[null,66045,"RISARALDA","APÍA",{"$f":"C900&\" - \"&D900","v":"RISARALDA - APÍA"},19577,2.96,1.8204,{"$f":"IF(H900<$P$3,$O$3,IF(H900<$P$4,$O$4,IF(H900<$P$5,$O$5,$O$6)))","v":1}]
[null,66075,"RISARALDA","BALBOA","RISARALDA - BALBOA",6329,0.98,0.60270000000000001,1]
[null,66088,"RISARALDA","BELÉN DE UMBRÍA","RISARALDA - BELÉN DE UMBRÍA",27727,7.69,4.7293500000000002,1]
[null,66170,"RISARALDA","DOSQUEBRADAS","RISARALDA - DOSQUEBRADAS",206692,144.6,88.929000000000002,3]
[null,66318,"RISARALDA","GUÁTICA","RISARALDA - GUÁTICA",15124,2.08,1.2792000000000001,1]
[null,66383,"RISARALDA","LA CELIA","RISARALDA - LA CELIA",8523,1.44,0.88559999999999994,1]
[null,66400,"RISARALDA","LA VIRGINIA","RISARALDA - LA VIRGINIA",32330,17.239999999999998,10.602599999999999,2]
[null,66440,"RISARALDA","MARSELLA","RISARALDA - MARSELLA",24131,3.01,1.8511499999999999,1]
[null,66456,"RISARALDA","MISTRATÓ","RISARALDA - MISTRATÓ",16750,2.15,1.3222499999999999,1]
[null,66572,"RISARALDA","PUEBLO RICO","RISARALDA - PUEBLO RICO",14003,2.0099999999999998,1.2361499999999999,1]
[null,66594,"RISARALDA","QUINCHÍA","RISARALDA - QUINCHÍA",34005,4.1100000000000003,2.52765,1]
[null,66682,"RISARALDA","SANTA ROSA DE CABAL","RISARALDA - SANTA ROSA DE CABAL",73028,41.7,25.645500000000002,2]
[null,66687,"RISARALDA","SANTUARIO","RISARALDA - SANTUARIO",15867,3.42,2.1032999999999999,1]
[null,68001,"SANTANDER","BUCARAMANGA","SANTANDER - BUCARAMANGA",528610,544.25,334.71375,3]
[null,68013,"SANTANDER","AGUADA","SANTANDER - AGUADA",1763,0.21,0.12914999999999999,1]
[null,68020,"SANTANDER","ALBANIA","SANTANDER - ALBANIA",5357,0.22,0.1353,1]
[null,68051,"SANTANDER","ARATOCA","SANTANDER - ARATOCA",8269,3.82,2.3492999999999999,1]
[null,68077,"SANTANDER","BARBOSA","SANTANDER - BARBOSA",29581,19.64,12.0786,2]
[null,68079,"SANTANDER","BARICHARA","SANTANDER - BARICHARA",7010,3.1,1.9065000000000001,1]
[null,68081,"SANTANDER","BARRANCABERMEJA","SANTANDER - BARRANCABERMEJA",191340,148.26,91.179899999999989,3]
[null,68092,"SANTANDER","BETULIA","SANTANDER - BETULIA",5014,2.13,1.3099499999999999,1]
[null,68101,"SANTANDER","BOLÍVAR","SANTANDER - BOLÍVAR",11778,0.42,0.25829999999999997,1]
[null,68121,"SANTANDER","CABRERA","SANTANDER - CABRERA",2442,0.12,7.3799999999999991E-2,1]
[null,68132,"SANTANDER","CALIFORNIA","SANTANDER - CALIFORNIA",2062,0.38,0.23369999999999999,1]
[null,68147,"SANTANDER","CAPITANEJO","SANTANDER - CAPITANEJO",5375,1.39,0.85484999999999989,1]
[null,68152,"SANTANDER","CARCASÍ","SANTANDER - CARCASÍ",4938,0.28999999999999998,0.17834999999999998,1]
[null,68160,"SANTANDER","CEPITÁ","SANTANDER - CEPITÁ",1804,0.22,0.1353,1]
[null,68162,"SANTANDER","CERRITO","SANTANDER - CERRITO",5473,1.51,0.92864999999999998,1]
[null,68167,"SANTANDER","CHARALÁ","SANTANDER - CHARALÁ",10211,3.95,2.4292500000000001,1]
[null,68169,"SANTANDER","CHARTA","SANTANDER - CHARTA",2514,0.22,0.1353,1]
[null,68176,"SANTANDER","CHIMA","SANTANDER - CHIMA",2999,0.27,0.16605,1]
[null,68179,"SANTANDER","CHIPATÁ","SANTANDER - CHIPATÁ",5052,0.21,0.12914999999999999,1]
[null,68190,"SANTANDER","CIMITARRA","SANTANDER - CIMITARRA",49593,15.13,9.3049499999999998,1]
[null,68207,"SANTANDER","CONCEPCIÓN","SANTANDER - CONCEPCIÓN",5042,1.1399999999999999,0.70109999999999995,1]
[null,68209,"SANTANDER","CONFINES","SANTANDER - CONFINES",2689,0.4,0.246,1]
[null,68211,"SANTANDER","CONTRATACIÓN","SANTANDER - CONTRATACIÓN",3311,0.46,0.28289999999999998,1]
[null,68217,"SANTANDER","COROMORO","SANTANDER - COROMORO",7659,0.42,0.25829999999999997,1]
[null,68229,"SANTANDER","CURITÍ","SANTANDER - CURITÍ",12065,3.72,2.2878000000000003,1]
[null,68235,"SANTANDER","EL CARMEN DE CHUCURÍ","SANTANDER - EL CARMEN DE CHUCURÍ",20858,0.69,0.42434999999999995,1]
[null,68245,"SANTANDER","EL GUACAMAYO","SANTANDER - EL GUACAMAYO",1883,0.17,0.10455,1]
[null,68250,"SANTANDER","EL PEÑÓN","SANTANDER - EL PEÑÓN",5008,0.43,0.26445000000000002,1]
[null,68255,"SANTANDER","EL PLAYÓN","SANTANDER - EL PLAYÓN",11252,3.26,2.0048999999999997,1]
[null,68264,"SANTANDER","ENCINO","SANTANDER - ENCINO",2425,0.31,0.19064999999999999,1]
[null,68266,"SANTANDER","ENCISO","SANTANDER - ENCISO",3085,0.47,0.28904999999999997,1]
[null,68271,"SANTANDER","FLORIÁN","SANTANDER - FLORIÁN",6268,0.37,0.22755,1]
[null,68276,"SANTANDER","FLORIDABLANCA","SANTANDER - FLORIDABLANCA",267538,201.48,123.91019999999999,3]
[null,68296,"SANTANDER","GALÁN","SANTANDER - GALÁN",2074,0.93,0.57195000000000007,1]
[null,68298,"SANTANDER","GÁMBITA","SANTANDER - GÁMBITA",5043,0.33,0.20295000000000002,1]
[null,68307,"SANTANDER","GIRÓN","SANTANDER - GIRÓN",200733,125.59,77.237849999999995,3]
[null,68318,"SANTANDER","GUACA","SANTANDER - GUACA",6208,0.56000000000000005,0.34440000000000004,1]
[null,68320,"SANTANDER","GUADALUPE","SANTANDER - GUADALUPE",4448,1.39,0.85484999999999989,1]
[null,68322,"SANTANDER","GUAPOTÁ","SANTANDER - GUAPOTÁ",2087,0.11,6.7650000000000002E-2,1]
[null,68324,"SANTANDER","GUAVATÁ","SANTANDER - GUAVATÁ",3429,0.5,0.3075,1]
[null,68327,"SANTANDER","GÜEPSA","SANTANDER - GÜEPSA",3689,1.08,0.66420000000000001,1]
[null,68344,"SANTANDER","HATO","SANTANDER - HATO",2319,0.31,0.19064999999999999,1]
[null,68368,"SANTANDER","JESÚS MARÍA","SANTANDER - JESÚS MARÍA",3024,0.45,0.27675,1]
[null,68370,"SANTANDER","JORDÁN","SANTANDER - JORDÁN",1084,0.08,4.9200000000000001E-2,1]
[null,68377,"SANTANDER","LA BELLEZA","SANTANDER - LA BELLEZA",8596,0.53,0.32595000000000002,1]
[null,68385,"SANTANDER","LANDÁZURI","SANTANDER - LANDÁZURI",15456,1.69,1.03935,1]
[null,68397,"SANTANDER","LA PAZ","SANTANDER - LA PAZ",4980,0.37,0.22755,1]
[null,68406,"SANTANDER","LEBRIJA","SANTANDER - LEBRIJA",42000,17.27,10.62105,2]
[null,68418,"SANTANDER","LOS SANTOS","SANTANDER - LOS SANTOS",12648,5.24,3.2225999999999999,1]
[null,68425,"SANTANDER","MACARAVITA","SANTANDER - MACARAVITA",2233,0.17,0.10455,1]
[null,68432,"SANTANDER","MÁLAGA","SANTANDER - MÁLAGA",18230,9.74,5.9901,1]
[null,68444,"SANTANDER","MATANZA",{"$f":"C964&\" - \"&D964","v":"SANTANDER - MATANZA"},5096,0.43,0.26445000000000002,{"$f":"IF(H964<$P$3,$O$3,IF(H964<$P$4,$O$4,IF(H964<$P$5,$O$5,$O$6)))","v":1}]
[null,68464,"SANTANDER","MOGOTES","SANTANDER - MOGOTES",10860,2.9,1.7834999999999999,1]
[null,68468,"SANTANDER","MOLAGAVITA","SANTANDER - MOLAGAVITA",4980,0.17,0.10455,1]
[null,68498,"SANTANDER","OCAMONTE","SANTANDER - OCAMONTE",4679,0.68,0.41820000000000002,1]
[null,68500,"SANTANDER","OIBA","SANTANDER - OIBA",12063,5.22,3.2102999999999997,1]
[null,68502,"SANTANDER","ONZAGA","SANTANDER - ONZAGA",4849,0.32,0.1968,1]
[null,68522,"SANTANDER","PALMAR","SANTANDER - PALMAR",3521,0.19,0.11685,1]
[null,68524,"SANTANDER","PALMAS DEL SOCORRO","SANTANDER - PALMAS DEL SOCORRO",2175,0.68,0.41820000000000002,1]
[null,68533,"SANTANDER","PÁRAMO","SANTANDER - PÁRAMO",4294,1.44,0.88559999999999994,1]
[null,68547,"SANTANDER","PIEDECUESTA","SANTANDER - PIEDECUESTA",163362,94.9,58.363500000000002,3]
[null,68549,"SANTANDER","PINCHOTE","SANTANDER - PINCHOTE",5545,1.23,0.75644999999999996,1]
[null,68572,"SANTANDER","PUENTE NACIONAL","SANTANDER - PUENTE NACIONAL",11718,2.65,1.62975,1]
[null,68573,"SANTANDER","PUERTO PARRA","SANTANDER - PUERTO PARRA",8011,1.52,0.93479999999999996,1]
[null,68575,"SANTANDER","PUERTO WILCHES","SANTANDER - PUERTO WILCHES",31509,23.26,14.3049,2]
[null,68615,"SANTANDER","RIONEGRO","SANTANDER - RIONEGRO",26243,6.3,3.8744999999999998,1]
[null,68655,"SANTANDER","SABANA DE TORRES","SANTANDER - SABANA DE TORRES",17965,6.8,4.1819999999999995,1]
[null,68669,"SANTANDER","SAN ANDRÉS","SANTANDER - SAN ANDRÉS",8094,1.04,0.63960000000000006,1]
[null,68673,"SANTANDER","SAN BENITO","SANTANDER - SAN BENITO",4030,0.11,6.7650000000000002E-2,1]
[null,68679,"SANTANDER","SAN GIL","SANTANDER - SAN GIL",46016,47.06,28.9419,2]
[null,68682,"SANTANDER","SAN JOAQUÍN","SANTANDER - SAN JOAQUÍN",2332,0.35,0.21525,1]
[null,68684,"SANTANDER","SAN JOSÉ DE MIRANDA","SANTANDER - SAN JOSÉ DE MIRANDA",4173,0.57999999999999996,0.35669999999999996,1]
[null,68686,"SANTANDER","SAN MIGUEL","SANTANDER - SAN MIGUEL",2252,0.16,9.8400000000000001E-2,1]
[null,68689,"SANTANDER","SAN VICENTE DE CHUCURÍ","SANTANDER - SAN VICENTE DE CHUCURÍ",35121,4.13,2.5399499999999997,1]
[null,68705,"SANTANDER","SANTA BÁRBARA","SANTANDER - SANTA BÁRBARA",2070,0.12,7.3799999999999991E-2,1]
[null,68720,"SANTANDER","SANTA HELENA DEL OPÓN","SANTANDER - SANTA HELENA DEL OPÓN",4247,0.13,7.9950000000000007E-2,1]
[null,68745,"SANTANDER","SIMACOTA","SANTANDER - SIMACOTA",7393,0.39,0.23985000000000001,1]
[null,68755,"SANTANDER","SOCORRO","SANTANDER - SOCORRO",31115,30.02,18.462299999999999,2]
[null,68770,"SANTANDER","SUAITA","SANTANDER - SUAITA",10006,1.17,0.71954999999999991,1]
[null,68773,"SANTANDER","SUCRE","SANTANDER - SUCRE",8098,0.72,0.44279999999999997,1]
[null,68780,"SANTANDER","SURATÁ","SANTANDER - SURATÁ",3166,0.28999999999999998,0.17834999999999998,1]
[null,68820,"SANTANDER","TONA","SANTANDER - TONA",7239,1.35,0.83025000000000004,1]
[null,68855,"SANTANDER","VALLE DE SAN JOSÉ","SANTANDER - VALLE DE SAN JOSÉ",4445,0.6,0.36899999999999999,1]
[null,68861,"SANTANDER","VÉLEZ","SANTANDER - VÉLEZ",18808,6.54,4.0221,1]
[null,68867,"SANTANDER","VETAS","SANTANDER - VETAS",2475,0.49,0.30135000000000001,1]
[null,68872,"SANTANDER","VILLANUEVA","SANTANDER - VILLANUEVA",5443,1.77,1.0885499999999999,1]
[null,68895,"SANTANDER","ZAPATOCA","SANTANDER - ZAPATOCA",8762,4.13,2.5399499999999997,1]
[null,70001,"SUCRE","SINCELEJO","SUCRE - SINCELEJO",290667,201.35,123.83024999999999,3]
[null,70110,"SUCRE","BUENAVISTA","SUCRE - BUENAVISTA",9808,1.55,0.95325000000000004,1]
[null,70124,"SUCRE","CAIMITO","SUCRE - CAIMITO",12542,0.6,0.36899999999999999,1]
[null,70204,"SUCRE","COLOSÓ","SUCRE - COLOSÓ",5696,1.45,0.89174999999999993,1]
[null,70215,"SUCRE","COROZAL","SUCRE - COROZAL",64073,46.16,28.388399999999997,2]
[null,70221,"SUCRE","COVEÑAS","SUCRE - COVEÑAS",14553,16.559999999999999,10.184399999999998,2]
[null,70230,"SUCRE","CHALÁN","SUCRE - CHALÁN",4416,1.19,0.73185,1]
[null,70233,"SUCRE","EL ROBLE","SUCRE - EL ROBLE",11044,1.2,0.73799999999999999,1]
[null,70235,"SUCRE","GALERAS","SUCRE - GALERAS",21548,5.83,3.5854499999999998,1]
[null,70265,"SUCRE","GUARANDA","SUCRE - GUARANDA",18365,4.0999999999999996,2.5214999999999996,1]
[null,70400,"SUCRE","LA UNIÓN","SUCRE - LA UNIÓN",11566,4.05,2.4907499999999998,1]
[null,70418,"SUCRE","LOS PALMITOS","SUCRE - LOS PALMITOS",19205,5.12,3.1488,1]
[null,70429,"SUCRE","MAJAGUAL","SUCRE - MAJAGUAL",34010,7.12,4.3788,1]
[null,70473,"SUCRE","MORROA","SUCRE - MORROA",15121,5.67,3.48705,1]
[null,70508,"SUCRE","OVEJAS","SUCRE - OVEJAS",20846,4.97,3.0565499999999997,1]
[null,70523,"SUCRE","PALMITO","SUCRE - PALMITO",14790,3.03,1.8634499999999998,1]
[null,70670,"SUCRE","SAMPUÉS","SUCRE - SAMPUÉS",38487,14.17,8.7145499999999991,1]
[null,70678,"SUCRE","SAN BENITO ABAD","SUCRE - SAN BENITO ABAD",26595,3.69,2.2693499999999998,1]
[null,70702,"SUCRE","SAN JUAN DE BETULIA","SUCRE - SAN JUAN DE BETULIA",12595,1.43,0.87944999999999995,1]
[null,70708,"SUCRE","SAN MARCOS","SUCRE - SAN MARCOS",59976,13,7.9950000000000001,1]
[null,70713,"SUCRE","SAN ONOFRE","SUCRE - SAN ONOFRE",51991,10.39,6.38985,1]
[null,70717,"SUCRE","SAN PEDRO","SUCRE - SAN PEDRO",15877,5.83,3.5854499999999998,1]
[null,70742,"SUCRE","SAN LUIS DE SINCÉ","SUCRE - SAN LUIS DE SINCÉ",35022,11.79,7.2508499999999998,1]
[null,70771,"SUCRE","SUCRE","SUCRE - SUCRE",22480,3.62,2.2263000000000002,1]
[null,70820,"SUCRE","SANTIAGO DE TOLÚ","SUCRE - SANTIAGO DE TOLÚ",35670,20.92,12.8658,2]
[null,70823,"SUCRE","SAN JOSÉ DE TOLUVIEJO","SUCRE - SAN JOSÉ DE TOLUVIEJO",18892,6.7,4.1204999999999998,1]
[null,73001,"TOLIMA","IBAGUÉ","TOLIMA - IBAGUÉ",574568,431.44,265.3356,3]
[null,73024,"TOLIMA","ALPUJARRA","TOLIMA - ALPUJARRA",4929,3.09,1.90035,1]
[null,73026,"TOLIMA","ALVARADO",{"$f":"C1028&\" - \"&D1028","v":"TOLIMA - ALVARADO"},8757,3.83,2.3554499999999998,{"$f":"IF(H1028<$P$3,$O$3,IF(H1028<$P$4,$O$4,IF(H1028<$P$5,$O$5,$O$6)))","v":1}]
[null,73030,"TOLIMA","AMBALEMA","TOLIMA - AMBALEMA",6521,3.06,1.8818999999999999,1]
[null,73043,"TOLIMA","ANZOÁTEGUI","TOLIMA - ANZOÁTEGUI",19278,1.59,0.97785,1]
[null,73055,"TOLIMA","ARMERO","TOLIMA - ARMERO",11490,6.3,3.8744999999999998,1]
[null,73067,"TOLIMA","ATACO","TOLIMA - ATACO",22818,1.73,1.06395,1]
[null,73124,"TOLIMA","CAJAMARCA","TOLIMA - CAJAMARCA",19596,6.56,4.0343999999999998,1]
[null,73148,"TOLIMA","CARMEN DE APICALÁ","TOLIMA - CARMEN DE APICALÁ",8956,8.0500000000000007,4.9507500000000002,1]
[null,73152,"TOLIMA","CASABIANCA","TOLIMA - CASABIANCA",6583,0.75,0.46124999999999999,1]
[null,73168,"TOLIMA","CHAPARRAL","TOLIMA - CHAPARRAL",47397,12.36,7.6013999999999999,1]
[null,73200,"TOLIMA","COELLO","TOLIMA - COELLO",10043,4.28,2.6322000000000001,1]
[null,73217,"TOLIMA","COYAIMA","TOLIMA - COYAIMA",28443,3.64,2.2385999999999999,1]
[null,73226,"TOLIMA","CUNDAY","TOLIMA - CUNDAY",9368,1.4,0.86099999999999999,1]
[null,73236,"TOLIMA","DOLORES","TOLIMA - DOLORES",7728,1.31,0.80564999999999998,1]
[null,73268,"TOLIMA","ESPINAL","TOLIMA - ESPINAL",75828,53.82,33.099299999999999,2]
[null,73270,"TOLIMA","FALAN","TOLIMA - FALAN",9188,1.07,0.65805000000000002,1]
[null,73275,"TOLIMA","FLANDES","TOLIMA - FLANDES",29478,19.78,12.1647,2]
[null,73283,"TOLIMA","FRESNO","TOLIMA - FRESNO",29794,5.16,3.1734,1]
[null,73319,"TOLIMA","GUAMO","TOLIMA - GUAMO",31350,14.79,9.0958499999999987,1]
[null,73347,"TOLIMA","HERVEO","TOLIMA - HERVEO",7693,1.89,1.16235,1]
[null,73349,"TOLIMA","HONDA","TOLIMA - HONDA",23830,19.13,11.764949999999999,2]
[null,73352,"TOLIMA","ICONONZO","TOLIMA - ICONONZO",10604,2.86,1.7588999999999999,1]
[null,73408,"TOLIMA","LÉRIDA","TOLIMA - LÉRIDA",16819,10.91,6.7096499999999999,1]
[null,73411,"TOLIMA","LÍBANO","TOLIMA - LÍBANO",39665,14.61,8.9851499999999991,1]
[null,73443,"TOLIMA","SAN SEBASTIÁN DE MARIQUITA","TOLIMA - SAN SEBASTIÁN DE MARIQUITA",33347,22.73,13.978949999999999,2]
[null,73449,"TOLIMA","MELGAR","TOLIMA - MELGAR",37224,38.229999999999997,23.511449999999996,2]
[null,73461,"TOLIMA","MURILLO","TOLIMA - MURILLO",4996,0.4,0.246,1]
[null,73483,"TOLIMA","NATAGAIMA","TOLIMA - NATAGAIMA",22320,4.87,2.99505,1]
[null,73504,"TOLIMA","ORTEGA","TOLIMA - ORTEGA",32164,1.88,1.1561999999999999,1]
[null,73520,"TOLIMA","PALOCABILDO","TOLIMA - PALOCABILDO",9052,2.0099999999999998,1.2361499999999999,1]
[null,73547,"TOLIMA","PIEDRAS","TOLIMA - PIEDRAS",5705,2.4300000000000002,1.4944500000000001,1]
[null,73555,"TOLIMA","PLANADAS","TOLIMA - PLANADAS",30117,4.93,3.0319499999999997,1]
[null,73563,"TOLIMA","PRADO","TOLIMA - PRADO",7429,2.39,1.4698500000000001,1]
[null,73616,"TOLIMA","RIOBLANCO","TOLIMA - RIOBLANCO",24139,1.05,0.64575000000000005,1]
[null,73624,"TOLIMA","ROVIRA","TOLIMA - ROVIRA",20255,5.62,3.4563000000000001,1]
[null,73671,"TOLIMA","SALDAÑA","TOLIMA - SALDAÑA",14184,7.51,4.6186499999999997,1]
[null,73675,"TOLIMA","SAN ANTONIO","TOLIMA - SAN ANTONIO",14059,1.92,1.1807999999999998,1]
[null,73678,"TOLIMA","SAN LUIS","TOLIMA - SAN LUIS",19117,4.54,2.7921,1]
[null,73686,"TOLIMA","SANTA ISABEL","TOLIMA - SANTA ISABEL",6301,0.63,0.38745000000000002,1]
[null,73770,"TOLIMA","SUÁREZ","TOLIMA - SUÁREZ",4554,1.44,0.88559999999999994,1]
[null,73854,"TOLIMA","VALLE DE SAN JUAN","TOLIMA - VALLE DE SAN JUAN",6427,1.69,1.03935,1]
[null,73861,"TOLIMA","VENADILLO","TOLIMA - VENADILLO",19825,5.87,3.6100500000000002,1]
[null,73870,"TOLIMA","VILLAHERMOSA","TOLIMA - VILLAHERMOSA",10463,0.39,0.23985000000000001,1]
[null,73873,"TOLIMA","VILLARRICA","TOLIMA - VILLARRICA",5177,1.05,0.64575000000000005,1]
[null,73585,"TOLIMA","PURIFICACIÓN","TOLIMA - PURIFICACIÓN",29777,12.16,7.4783999999999997,1]
[null,73622,"TOLIMA","RONCESVALLES","TOLIMA - RONCESVALLES",6363,0.67,0.41205000000000003,1]
[null,76001,"VALLE DEL CAUCA","CALI","VALLE DEL CAUCA - CALI",2470852,2209.62,1358.9162999999999,4]
[null,76020,"VALLE DEL CAUCA","ALCALÁ","VALLE DEL CAUCA - ALCALÁ",23195,3.28,2.0171999999999999,1]
[null,76036,"VALLE DEL CAUCA","ANDALUCÍA","VALLE DEL CAUCA - ANDALUCÍA",17713,12.17,7.4845499999999996,1]
[null,76041,"VALLE DEL CAUCA","ANSERMANUEVO","VALLE DEL CAUCA - ANSERMANUEVO",19160,4.16,2.5584000000000002,1]
[null,76054,"VALLE DEL CAUCA","ARGELIA","VALLE DEL CAUCA - ARGELIA",6346,1.22,0.75029999999999997,1]
[null,76100,"VALLE DEL CAUCA","BOLÍVAR","VALLE DEL CAUCA - BOLÍVAR",12795,3.6,2.214,1]
[null,76109,"VALLE DEL CAUCA","BUENAVENTURA","VALLE DEL CAUCA - BUENAVENTURA",432501,184,113.16,3]
[null,76111,"VALLE DEL CAUCA","GUADALAJARA DE BUGA","VALLE DEL CAUCA - GUADALAJARA DE BUGA",114316,121.19,74.531849999999991,3]
[null,76113,"VALLE DEL CAUCA","BUGALAGRANDE","VALLE DEL CAUCA - BUGALAGRANDE",20970,11.88,7.3062000000000005,1]
[null,76122,"VALLE DEL CAUCA","CAICEDONIA","VALLE DEL CAUCA - CAICEDONIA",29424,11.37,6.9925499999999996,1]
[null,76126,"VALLE DEL CAUCA","CALIMA","VALLE DEL CAUCA - CALIMA",15873,15.28,9.3971999999999998,1]
[null,76130,"VALLE DEL CAUCA","CANDELARIA","VALLE DEL CAUCA - CANDELARIA",86584,56.61,34.815149999999996,2]
[null,76147,"VALLE DEL CAUCA","CARTAGO","VALLE DEL CAUCA - CARTAGO",134972,98.57,60.620549999999994,3]
[null,76233,"VALLE DEL CAUCA","DAGUA","VALLE DEL CAUCA - DAGUA",36891,25.52,15.694799999999999,2]
[null,76243,"VALLE DEL CAUCA","EL ÁGUILA","VALLE DEL CAUCA - EL ÁGUILA",11261,1.7,1.0454999999999999,1]
[null,76246,"VALLE DEL CAUCA","EL CAIRO","VALLE DEL CAUCA - EL CAIRO",10258,1.42,0.87329999999999997,1]
[null,76248,"VALLE DEL CAUCA","EL CERRITO","VALLE DEL CAUCA - EL CERRITO",58563,41.82,25.7193,2]
[null,76250,"VALLE DEL CAUCA","EL DOVIO","VALLE DEL CAUCA - EL DOVIO",8143,3.03,1.8634499999999998,1]
[null,76275,"VALLE DEL CAUCA","FLORIDA","VALLE DEL CAUCA - FLORIDA",58988,40.57,24.95055,2]
[null,76306,"VALLE DEL CAUCA","GINEBRA",{"$f":"C1092&\" - \"&D1092","v":"VALLE DEL CAUCA - GINEBRA"},21815,14.09,8.6653500000000001,{"$f":"IF(H1092<$P$3,$O$3,IF(H1092<$P$4,$O$4,IF(H1092<$P$5,$O$5,$O$6)))","v":1}]
[null,76318,"VALLE DEL CAUCA","GUACARÍ","VALLE DEL CAUCA - GUACARÍ",35662,18.809999999999999,11.568149999999999,2]
[null,76364,"VALLE DEL CAUCA","JAMUNDÍ","VALLE DEL CAUCA - JAMUNDÍ",129877,95.2,58.548000000000002,3]
[null,76377,"VALLE DEL CAUCA","LA CUMBRE","VALLE DEL CAUCA - LA CUMBRE",11731,13.47,8.2840500000000006,1]
[null,76400,"VALLE DEL CAUCA","LA UNIÓN","VALLE DEL CAUCA - LA UNIÓN",40339,20.32,12.4968,2]
[null,76403,"VALLE DEL CAUCA","LA VICTORIA","VALLE DEL CAUCA - LA VICTORIA",12902,5.93,3.6469499999999999,1]
[null,76497,"VALLE DEL CAUCA","OBANDO","VALLE DEL CAUCA - OBANDO",15318,4.18,2.5707,1]
[null,76520,"VALLE DEL CAUCA","PALMIRA","VALLE DEL CAUCA - PALMIRA",312507,247.79,152.39085,3]
[null,76563,"VALLE DEL CAUCA","PRADERA","VALLE DEL CAUCA - PRADERA",57990,29.38,18.0687,2]
[null,76606,"VALLE DEL CAUCA","RESTREPO","VALLE DEL CAUCA - RESTREPO",16410,12.71,7.8166500000000001,1]
[null,76616,"VALLE DEL CAUCA","RIOFRÍO","VALLE DEL CAUCA - RIOFRÍO",13807,4.6900000000000004,2.8843500000000004,1]
[null,76622,"VALLE DEL CAUCA","ROLDANILLO","VALLE DEL CAUCA - ROLDANILLO",32035,17.920000000000002,11.020800000000001,2]
[null,76670,"VALLE DEL CAUCA","SAN PEDRO","VALLE DEL CAUCA - SAN PEDRO",19129,9.93,6.1069499999999994,1]
[null,76736,"VALLE DEL CAUCA","SEVILLA","VALLE DEL CAUCA - SEVILLA",44028,15.28,9.3971999999999998,1]
[null,76823,"VALLE DEL CAUCA","TORO","VALLE DEL CAUCA - TORO",16669,4.47,2.74905,1]
[null,76828,"VALLE DEL CAUCA","TRUJILLO","VALLE DEL CAUCA - TRUJILLO",17859,5.77,3.5485499999999996,1]
[null,76834,"VALLE DEL CAUCA","TULUÁ","VALLE DEL CAUCA - TULUÁ",221701,195.22,120.0603,3]
[null,76845,"VALLE DEL CAUCA","ULLOA","VALLE DEL CAUCA - ULLOA",5301,1.61,0.99015000000000009,1]
[null,76863,"VALLE DEL CAUCA","VERSALLES","VALLE DEL CAUCA - VERSALLES",6823,1.02,0.62729999999999997,1]
[null,76869,"VALLE DEL CAUCA","VIJES","VALLE DEL CAUCA - VIJES",11543,5.91,3.6346500000000002,1]
[null,76890,"VALLE DEL CAUCA","YOTOCO","VALLE DEL CAUCA - YOTOCO",16560,6.71,4.1266499999999997,1]
[null,76892,"VALLE DEL CAUCA","YUMBO","VALLE DEL CAUCA - YUMBO",128616,147.53,90.730949999999993,3]
[null,76895,"VALLE DEL CAUCA","ZARZAL","VALLE DEL CAUCA - ZARZAL",47062,34.869999999999997,21.445049999999998,2]
[null,97001,"VAUPÉS","MITÚ","VAUPÉS - MITÚ",32764,4.63,2.8474499999999998,1]
[null,97161,"VAUPÉS","CARURÚ","VAUPÉS - CARURÚ",3344,0.5,0.3075,1]
[null,97666,"VAUPÉS","TARAIRA","VAUPÉS - TARAIRA",944,0.42,0.25829999999999997,1]
[null,97511,"VAUPÉS","PACOA  ","VAUPÉS - PACOA  ",6265,2.85684,1.7569566000000001,1]
[null,97777,"VAUPÉS","PAPUNAUA  ","VAUPÉS - PAPUNAUA  ",828,0.37756799999999996,0.23220431999999996,1]
[null,97889,"VAUPÉS","YAVARATÉ  ","VAUPÉS - YAVARATÉ  ",1222,0.55723199999999995,0.34269767999999995,1]
[null,99001,"VICHADA","PUERTO CARREÑO","VICHADA - PUERTO CARREÑO",16763,15.85,9.7477499999999999,1]
[null,99524,"VICHADA","la primavera","VICHADA - la primavera",17626,3.53,2.1709499999999999,1]
[null,99624,"VICHADA","santa rosalía","VICHADA - santa rosalía",4255,0.79,0.48585,1]
[null,99773,"VICHADA","cumaribo","VICHADA - cumaribo",40490,4.6500000000000004,2.85975,1]

{"sheet":"Información referencia","index":15,"n_rows":14,"n_cols":4,"rows_kept":14,"cut":false,"hidden":true,"merged":[]}
[]
["% Humedad RSO",0.68,null,"https://www.ambientum.com/enciclopedia_medioambiental/suelos/caracteristicas_fisicas.asp"]
[]
[]
[]
[]
[]
["Cenizas RSU promedio",0.10199999999999999]
["Sólidos Volátiles RSU promedio",0.43099999999999999]
["Vida útil proyecto",25]
[]
[]
["Kg/hab-día Colombia",0.78]
["Porcentaje de residuos sólidos orgánicos Colombia",0.61]

{"sheet":"Medidas Escenarios","index":16,"n_rows":9,"n_cols":2,"rows_kept":9,"cut":false,"hidden":true,"merged":[]}
[1,"1) Implemente sistemas de extracción y aprovechamiento de biogás en el sitio de disposición final\n2) Tenga en cuenta en la evaluación de factibilidad la gestión e inversiones necesarias para lograr la disponibilidad del terreno donde se vaya a desarrollar el proyecto.\n3) Actualice la infraestructura para la presentación de los residuos sólidos para adoptar el código de colores establecido en la Resolución 2184 de 2019\n4) Lleve a cabo el diseño e implementación de manuales de operación y mantenimiento.\n5) Implemente un sistema de Monitoreo, Reporte y Verificación (MRV) de emisiones de la reducción de emisiones de GEI \n6) Evalue la viabilidad de incluir esquemas de fuentes de financiación verde a partir de la reducción de emisiones de GEI. \n"]
[2,"1) Actualice el PGIRS, que prevea la viabilidad de proyectos para el tratamiento de residuos sólidos. Para ello como mínimo debe realizarse la actualización o elaboración de:\na. Caracterización de residuos con especial énfasis en la fracción orgánica\nb. Estudios técnico-operativos para determinar el tipo de tratamiento más viable\nc. Estudios de mercado que permitan determinar la viabilidad del tratamiento\n2) Fortalezca la capacidad administrativa de los municipios revisando los indicadores de gestión y resultados de la Medición de Desempeño Municipal (MDM) en los cuales existen falencias.\n3) Amplie la destinación de recursos para financiar actividades del servicio público de aseo\n4) Implemente sistemas de extracción y aprovechamiento de biogás en el sitio de disposición final\n5) Implemente un sistema de Monitoreo, Reporte y Verificación (MRV) de emisiones de la reducción de emisiones de GEI\n6) Actualice la infraestructura para la presentación de los residuos sólidos para adoptar el código de colores establecido en la Resolución 2184 de 2019.\n"]
[3,"1) Actualice el PGIRS, que prevea la viabilidad de proyectos para el tratamiento de residuos sólidos. Para ello como mínimo debe realizarse la actualización o elaboración de:\na. Caracterización de residuos con especial énfasis en la fracción orgánica\nb. Estudios técnico-operativos para determinar el tipo de tratamiento más viable\nc. Estudios de mercado que permitan determinar la viabilidad del tratamiento\n2) Fortalezca la capacidad administrativa de los municipios revisando los indicadores de gestión y resultados de la Medición de Desempeño Municipal (MDM)  en los cuales existen falencias.\n3) Amplie la destinación de recursos para financiar actividades del servicio público de aseo\n4) Establezca campañas de sensibilización sobre separación en la fuente\n5) Garantice la disposición final en rellenos sanitarios regionales o municipales existentes o nuevos. Implementar sistemas de extracción y aprovechamiento de biogás en el sitio de disposición final\n6) Identifique áreas afectadas por actividades de disposición final y transferencia, suelos urbanos con actividades definidas como industriales de alto impacto o suelos de expansión y rurales sin restricciones ambientales y debidamente recogidas en la cartografía oficial que puedan ser incluidos por la entidad territorial como áreas para la edificación de infraestructura de tratamiento\n7) Implemente un sistema de Monitoreo, Reporte y Verificación (MRV) de emisiones de la reducción de emisiones de GEI\n8) Actualice la infraestructura para la presentación de los residuos sólidos para adoptar el código de colores establecido en la Resolución 2184 de 2019\n9) Impulse o fortalecer la implementación de rutas selectivas"]
[4,"1) Fortalezca la capacidad administrativa de los municipios revisando los indicadores de gestión y resultados de la Medición de Desempeño Municipal (MDM)  en los cuales existen falencias.\n2) Amplie la destinación de recursos para financiar actividades del servicio público de aseo\n3) Amplie la cobertura de la recolección y transporte de residuos en zona rural y urbana\n4) Establezca campañas de sensibilización sobre separación en la fuente\n5) Mejore condiciones de disposición final a partir de la construcción o ampliación de un relleno sanitario, analizando la posibilidad de unirse a esquemas regionales existentes o nuevos; de no ser viable un sistema regional, construir un sistema municipal/local.\n6) Cierre sitios de disposición final no adecuados\n7) Identifique áreas afectadas por actividades de disposición final y transferencia, suelos urbanos con actividades definidas como industriales de alto impacto o suelos de expansión y rurales sin restricciones ambientales y debidamente recogidas en la cartografía oficial que puedan ser incluidos por la entidad territorial como áreas para la edificación de infraestructura de tratamiento\n8) Actualice la infraestructura para la presentación de los residuos sólidos para adoptar el código de colores establecido en la Resolución 2184 de 2019\n9) Impulse o fortalecer la implementación de rutas selectivas\n"]
[5,"1) Fortalezca la capacidad administrativa de los municipios revisando los indicadores de gestión y resultados de la MDM en los cuales existen falencias.\n2) Mejore la continuidad en la recolección y transporte de residuos sólidos y en las frecuencias establecidas para tal fin\n3) Establezca campañas de sensibilización sobre la gestión de residuos sólidos y sus impactos\n4) Cierre sitios de disposición final no adecuados\n5) Identifique alternativas adecuadas para realizar la disposición final de los residuos sólidos de manera adecuada\n6) Identifique suelos urbanos con actividades definidas como industriales de alto impacto o suelos de expansión y rurales sin restricciones ambientales y debidamente recogidas en la cartografía oficial que puedan ser incluidos por la entidad territorial como áreas para la edificación de infraestructura de tratamiento\n7) Actualce la infraestructura para la presentación de los residuos sólidos para adoptar el código de colores establecido en la Resolución 2184 de 2019\n8) Impulse o fortalecer la implementación de rutas selectivas"]
[6,"1) Fortalezca la capacidad administrativa de los municipios revisando los indicadores de gestión y resultados de la MDM en los cuales existen falencias.\n2) Ample la destinación de recursos para el acceso a los servicios públicos de los habitantes del municipio o región\n3) Establezca un sistema de recolección de residuos sólidos\n4) Establezcacampañas de sensibilización sobre la gestión de residuos sólidos y sus impactos\n5) Disponga los residuos sólidos recolectados\n6) Cierre sitios de disposición final no adecuados\n7) Identifique maneras adecuadas para realizar la disposición final de los residuos sólidos de manera adecuada\n8) Identifque suelos urbanos con actividades definidas como industriales de alto impacto o suelos de expansión y rurales sin restricciones ambientales y debidamente recogidas en la cartografía oficial que puedan ser incluidos por la entidad territorial como áreas para la edificación de infraestructura de tratamiento\n9) Actualice la infraestructura para la presentación de los residuos sólidos para adoptar el código de colores establecido en la Resolución 2184 de 2019\n10) Impulse o fortalecer la implementación de rutas selectivas"]
[null,"Dado el contexto del proyecto, es recomendable continuar con las siguientes fases de planeación para el tratamiento de residuos sólidos órganicos implementando una o la combinación de las tecnologías identificadas en este reporte. Las alternativas contempladas se basan en tecnologías probadas (el análisis de tecnologias no convencionales deberá tener el cuenta lo establecido en el reglamento técnico para el sector de agua potable y saneamiento RAS)."]
[null,"Dado el contexto del proyecto, no es recomendable desarrollar un sistema de tratamiento de residuos sólidos órganicos hasta que las condiciones administrativas, técnicas y económicas así lo ameriten."]
[null,"El proyecto no presenta un nivel de favorabilidad completamente adecuado para la implementación de un proyecto de tratamiento de residuos sólidos órganicos. No obstante, dado que no se cuenta con infraestructura para realizar una disposición final adecuada de los residuos sólidos (carreteras disponibles y en buen estado), se recomienda adelantar las siguiente fase de planeación para un sistema de tratamiento a partir de las tecnologías descritas en este reporte, incorporando las soluciones de accesibilidad necesarias."]

{"sheet":"Listas","index":17,"n_rows":27,"n_cols":7,"rows_kept":27,"cut":false,"hidden":true,"merged":[]}
["Medición Desempeño Municipal",null,"Categoría Municipal (Ley 617 de 2000)",null,"Afirmación/Negación",null,"Estado de las vías"]
["Bajo",null,"Especial",null,"Si",null,"Inexistentes o distintas a vía terreste"]
["Crítico",null,"Primera",null,"No",null,"Tramo mayoritariamente despavimentado, difícil acceso"]
["Medio",null,"Segunda",null,null,null,"Tramo mayoritariamente despavimentado, fácil acceso"]
["Satisfactorio",null,"Tercera",null,null,null,"Tramo mayoritariamente pavimentado, difícil acceso"]
["Sobresaliente",null,"Cuarta",null,null,null,"Tramo mayoritariamente pavimentado, fácil acceso"]
[null,null,"Quinta"]
[null,null,"Sexta"]
[]
[]
[]
[]
["Tipo de sitio de disposición final",null,"Sistema de extracción y aprovechamiento de biogás",null,"Toneladas mensuales promedio de residuos sólidos provenientes de las actividades de corte de césped y poda de árboles",null,"Cobertura en la recolección y transporte de residuos"]
["Relleno Sanitario",null,"No cuenta con sistema de extracción del biogás",null,"Menos de 30",null,"Menor al 50%"]
["Celda de contingencia",null,"Cuenta con sistema de extracción más no de aprovechamiento",null,"Más de 30 y menos de 300",null,"Entre el 50% y el 75%"]
["Celda transitoria",null,"Cuenta con sistema de extracción y de aprovechamiento",null,"Más de 300 y menos de 1500",null,"Entre el 75% y el 90%"]
["Botadero a cielo abierto",null,null,null,"Más de 1500",null,"Superior al 90%"]
["Otro"]
[]
[]
[]
["Distancia a sitio de disposición final",null,"Años de operación y vida útil del sitio de disposición final",null,"Índice de Pobreza Multidimensional",null,"Tipo de actor"]
["Menor a 10 km",null,"Menos de 5 años",null,"Menor al 10%",null,"Entidad Territorial"]
["Entre 10 km y 20 km",null,"Entre 5 y 10 años ",null,"Entre el 10% y el 25%",null,"Prestador del Servicio Público de Aseo"]
["Entre 20 km y 50 km",null,"Entre 10 y 15 años",null,"Entre el 25% y el 50%",null,"Otro"]
["Entre 50 km y 100 km",null,"Entre 15 y 20 años",null,"Entre el 50% y el 75%"]
["Más de 100 km",null,"Más de 20 años",null,"Superior al 75%"]

{"sheet":"Nacional_Área","index":18,"n_rows":170,"n_cols":9,"rows_kept":170,"cut":false,"hidden":true,"merged":[[5,0,6,4],[7,0,7,4]]}
[]
[]
[]
[]
[]
["PROYECCIONES DE POBLACIÓN NACIONAL, POR ÁREA."]
[]
["PROYECCIONES DE POBLACIÓN A NIVEL NACIONAL. PERIODO 2018 - 2070."]
[]
[]
["Código","Nombre","Año","Área","Población"]
["00","Total Nacional","2018","Cabecera Municipal",36424653]
["00","Total Nacional","2018","Centros Poblados y Rural Disperso",11833841]
["00","Total Nacional","2018","Total",48258494]
["00","Total Nacional","2019","Cabecera Municipal",37425856]
["00","Total Nacional","2019","Centros Poblados y Rural Disperso",11969822]
["00","Total Nacional","2019","Total",49395678,{"$f":"+E17/E14-1","v":2.3564431994085755E-2}]
["00","Total Nacional","2020","Cabecera Municipal",38293939]
["00","Total Nacional","2020","Centros Poblados y Rural Disperso",12078485]
["00","Total Nacional","2020","Total",50372424,{"$f":"+E20/E17-1","v":1.9773916252349144E-2},"PROMEDIO 2021-2045",null,{"$f":"ROUNDUP(AVERAGE(F23:F95),3)","v":8.0000000000000002E-3}]
["00","Total Nacional","2021","Cabecera Municipal",38898851]
["00","Total Nacional","2021","Centros Poblados y Rural Disperso",12150647]
["00","Total Nacional","2021","Total",51049498,{"$f":"+E23/E20-1","v":1.3441362281870761E-2}]
["00","Total Nacional","2022","Cabecera Municipal",39388690]
["00","Total Nacional","2022","Centros Poblados y Rural Disperso",12220784]
["00","Total Nacional","2022","Total",51609474,{"$f":"+E26/E23-1","v":1.0969275349191454E-2}]
["00","Total Nacional","2023","Cabecera Municipal",39862623]
["00","Total Nacional","2023","Centros Poblados y Rural Disperso",12293631]
["00","Total Nacional","2023","Total",52156254,{"$f":"+E29/E26-1","v":1.0594566416235907E-2}]
["00","Total Nacional","2024","Cabecera Municipal",40321112]
["00","Total Nacional","2024","Centros Poblados y Rural Disperso",12370328]
["00","Total Nacional","2024","Total",52691440,{"$f":"+E32/E29-1","v":1.0261204725324102E-2}]
["00","Total Nacional","2025","Cabecera Municipal",40764914]
["00","Total Nacional","2025","Centros Poblados y Rural Disperso",12451678]
["00","Total Nacional","2025","Total",53216592,{"$f":"+E35/E32-1","v":9.9665524419145779E-3}]
["00","Total Nacional","2026","Cabecera Municipal",41194081]
["00","Total Nacional","2026","Centros Poblados y Rural Disperso",12538334]
["00","Total Nacional","2026","Total",53732415,{"$f":"+E38/E35-1","v":9.6928980345076798E-3}]
["00","Total Nacional","2027","Cabecera Municipal",41607327]
["00","Total Nacional","2027","Centros Poblados y Rural Disperso",12630427]
["00","Total Nacional","2027","Total",54237754,{"$f":"+E41/E38-1","v":9.4047326925470465E-3}]
["00","Total Nacional","2028","Cabecera Municipal",42003061]
["00","Total Nacional","2028","Centros Poblados y Rural Disperso",12728125]
["00","Total Nacional","2028","Total",54731186,{"$f":"+E44/E41-1","v":9.0975743575223422E-3}]
["00","Total Nacional","2029","Cabecera Municipal",42379593]
["00","Total Nacional","2029","Centros Poblados y Rural Disperso",12831665]
["00","Total Nacional","2029","Total",55211258,{"$f":"+E47/E44-1","v":8.7714525316517911E-3}]
["00","Total Nacional","2030","Cabecera Municipal",42736325]
["00","Total Nacional","2030","Centros Poblados y Rural Disperso",12941758]
["00","Total Nacional","2030","Total",55678083,{"$f":"+E50/E47-1","v":8.455250195530839E-3}]
["00","Total Nacional","2031","Cabecera Municipal",43077006]
["00","Total Nacional","2031","Centros Poblados y Rural Disperso",13054836]
["00","Total Nacional","2031","Total",56131842,{"$f":"+E53/E50-1","v":8.1496879122078258E-3}]
["00","Total Nacional","2032","Cabecera Municipal",43405082]
["00","Total Nacional","2032","Centros Poblados y Rural Disperso",13166615]
["00","Total Nacional","2032","Total",56571697,{"$f":"+E56/E53-1","v":7.8361048618358353E-3}]
["00","Total Nacional","2033","Cabecera Municipal",43720264]
["00","Total Nacional","2033","Centros Poblados y Rural Disperso",13276885]
["00","Total Nacional","2033","Total",56997149,{"$f":"+E59/E56-1","v":7.5205804768416762E-3}]
["00","Total Nacional","2034","Cabecera Municipal",44022283]
["00","Total Nacional","2034","Centros Poblados y Rural Disperso",13385476]
["00","Total Nacional","2034","Total",57407759,{"$f":"+E62/E59-1","v":7.2040445391399199E-3}]
["00","Total Nacional","2035","Cabecera Municipal",44311552]
["00","Total Nacional","2035","Centros Poblados y Rural Disperso",13492595]
["00","Total Nacional","2035","Total",57804147,{"$f":"+E65/E62-1","v":6.90478093736413E-3}]
["00","Total Nacional","2036","Cabecera Municipal",44586719]
["00","Total Nacional","2036","Centros Poblados y Rural Disperso",13599699]
["00","Total Nacional","2036","Total",58186418,{"$f":"+E68/E65-1","v":6.6132106404062085E-3}]
["00","Total Nacional","2037","Cabecera Municipal",44849820]
["00","Total Nacional","2037","Centros Poblados y Rural Disperso",13703941]
["00","Total Nacional","2037","Total",58553761,{"$f":"+E71/E68-1","v":6.3132086941664056E-3}]
["00","Total Nacional","2038","Cabecera Municipal",45099430]
["00","Total Nacional","2038","Centros Poblados y Rural Disperso",13806476]
["00","Total Nacional","2038","Total",58905906,{"$f":"+E74/E71-1","v":6.0140457928909985E-3}]
["00","Total Nacional","2039","Cabecera Municipal",45335457]
["00","Total Nacional","2039","Centros Poblados y Rural Disperso",13907158]
["00","Total Nacional","2039","Total",59242615,{"$f":"+E77/E74-1","v":5.7160482346201302E-3}]
["00","Total Nacional","2040","Cabecera Municipal",45558249]
["00","Total Nacional","2040","Centros Poblados y Rural Disperso",14006148]
["00","Total Nacional","2040","Total",59564397,{"$f":"+E80/E77-1","v":5.4315968327867115E-3}]
["00","Total Nacional","2041","Cabecera Municipal",45768129]
["00","Total Nacional","2041","Centros Poblados y Rural Disperso",14103632]
["00","Total Nacional","2041","Total",59871761,{"$f":"+E83/E80-1","v":5.1601966187955206E-3}]
["00","Total Nacional","2042","Cabecera Municipal",45965007]
["00","Total Nacional","2042","Centros Poblados y Rural Disperso",14199517]
["00","Total Nacional","2042","Total",60164524,{"$f":"+E86/E83-1","v":4.8898344580177167E-3}]
["00","Total Nacional","2043","Cabecera Municipal",46148856]
["00","Total Nacional","2043","Centros Poblados y Rural Disperso",14293733]
["00","Total Nacional","2043","Total",60442589,{"$f":"+E89/E86-1","v":4.6217435377697846E-3}]
["00","Total Nacional","2044","Cabecera Municipal",46319674]
["00","Total Nacional","2044","Centros Poblados y Rural Disperso",14386257]
["00","Total Nacional","2044","Total",60705931,{"$f":"+E92/E89-1","v":4.3568947716650097E-3}]
["00","Total Nacional","2045","Cabecera Municipal",46477719]
["00","Total Nacional","2045","Centros Poblados y Rural Disperso",14477239]
["00","Total Nacional","2045","Total",60954958,{"$f":"+E95/E92-1","v":4.102185666174929E-3}]
["00","Total Nacional","2046","Cabecera Municipal",46623579]
["00","Total Nacional","2046","Centros Poblados y Rural Disperso",14566590]
["00","Total Nacional","2046","Total",61190169,{"$f":"+E98/E95-1","v":3.8587673212735485E-3}]
["00","Total Nacional","2047","Cabecera Municipal",46757622]
["00","Total Nacional","2047","Centros Poblados y Rural Disperso",14654063]
["00","Total Nacional","2047","Total",61411685,{"$f":"+E101/E98-1","v":3.6201240104436483E-3}]
["00","Total Nacional","2048","Cabecera Municipal",46879896]
["00","Total Nacional","2048","Centros Poblados y Rural Disperso",14739585]
["00","Total Nacional","2048","Total",61619481,{"$f":"+E104/E101-1","v":3.3836557326183403E-3}]
["00","Total Nacional","2049","Cabecera Municipal",46990455]
["00","Total Nacional","2049","Centros Poblados y Rural Disperso",14823102]
["00","Total Nacional","2049","Total",61813557,{"$f":"+E107/E104-1","v":3.1495883582661754E-3}]
["00","Total Nacional","2050","Cabecera Municipal",47089493]
["00","Total Nacional","2050","Centros Poblados y Rural Disperso",14904690]
["00","Total Nacional","2050","Total",61994183,{"$f":"+E110/E107-1","v":2.9221097889577941E-3}]
["00","Total Nacional","2051","Cabecera Municipal",47177278]
["00","Total Nacional","2051","Centros Poblados y Rural Disperso",14984435]
["00","Total Nacional","2051","Total",62161713,{"$f":"+E113/E110-1","v":2.702350315674007E-3}]
["00","Total Nacional","2052","Cabecera Municipal",47253907]
["00","Total Nacional","2052","Centros Poblados y Rural Disperso",15062310]
["00","Total Nacional","2052","Total",62316217]
["00","Total Nacional","2053","Cabecera Municipal",47319418]
["00","Total Nacional","2053","Centros Poblados y Rural Disperso",15138287]
["00","Total Nacional","2053","Total",62457705]
["00","Total Nacional","2054","Cabecera Municipal",47373875]
["00","Total Nacional","2054","Centros Poblados y Rural Disperso",15212325]
["00","Total Nacional","2054","Total",62586200]
["00","Total Nacional","2055","Cabecera Municipal",47417429]
["00","Total Nacional","2055","Centros Poblados y Rural Disperso",15284488]
["00","Total Nacional","2055","Total",62701917]
["00","Total Nacional","2056","Cabecera Municipal",47450292]
["00","Total Nacional","2056","Centros Poblados y Rural Disperso",15354835]
["00","Total Nacional","2056","Total",62805127]
["00","Total Nacional","2057","Cabecera Municipal",47472623]
["00","Total Nacional","2057","Centros Poblados y Rural Disperso",15423350]
["00","Total Nacional","2057","Total",62895973]
["00","Total Nacional","2058","Cabecera Municipal",47484515]
["00","Total Nacional","2058","Centros Poblados y Rural Disperso",15489995]
["00","Total Nacional","2058","Total",62974510]
["00","Total Nacional","2059","Cabecera Municipal",47486075]
["00","Total Nacional","2059","Centros Poblados y Rural Disperso",15554770]
["00","Total Nacional","2059","Total",63040845]
["00","Total Nacional","2060","Cabecera Municipal",47477508]
["00","Total Nacional","2060","Centros Poblados y Rural Disperso",15617680]
["00","Total Nacional","2060","Total",63095188]
["00","Total Nacional","2061","Cabecera Municipal",47459047]
["00","Total Nacional","2061","Centros Poblados y Rural Disperso",15678764]
["00","Total Nacional","2061","Total",63137811]
["00","Total Nacional","2062","Cabecera Municipal",47430889]
["00","Total Nacional","2062","Centros Poblados y Rural Disperso",15738011]
["00","Total Nacional","2062","Total",63168900]
["00","Total Nacional","2063","Cabecera Municipal",47393187]
["00","Total Nacional","2063","Centros Poblados y Rural Disperso",15795396]
["00","Total Nacional","2063","Total",63188583]
["00","Total Nacional","2064","Cabecera Municipal",47346106]
["00","Total Nacional","2064","Centros Poblados y Rural Disperso",15850898]
["00","Total Nacional","2064","Total",63197004]
["00","Total Nacional","2065","Cabecera Municipal",47289834]
["00","Total Nacional","2065","Centros Poblados y Rural Disperso",15904525]
["00","Total Nacional","2065","Total",63194359]
["00","Total Nacional","2066","Cabecera Municipal",47224624]
["00","Total Nacional","2066","Centros Poblados y Rural Disperso",15956298]
["00","Total Nacional","2066","Total",63180922]
["00","Total Nacional","2067","Cabecera Municipal",47150698]
["00","Total Nacional","2067","Centros Poblados y Rural Disperso",16006204]
["00","Total Nacional","2067","Total",63156902]
["00","Total Nacional","2068","Cabecera Municipal",47068275]
["00","Total Nacional","2068","Centros Poblados y Rural Disperso",16054213]
["00","Total Nacional","2068","Total",63122488]
["00","Total Nacional","2069","Cabecera Municipal",46977554]
["00","Total Nacional","2069","Centros Poblados y Rural Disperso",16100319]
["00","Total Nacional","2069","Total",63077873]
["00","Total Nacional","2070","Cabecera Municipal",46878800]
["00","Total Nacional","2070","Centros Poblados y Rural Disperso",16144534]
["00","Total Nacional","2070","Total",63023334]